{"text_format":"1","workbook":"xlsx","n_sheets":15,"sheets":["様式３－２－１（学校基本情報）","様式３－２－２","様式３－２－３","様式３－２－４","様式３－２－５","【別添】様式３－２－５","様式３－２－６","様式３－２－７－１","（回答不用）様式３－２－７－２","様式３－２－８－１","（回答不用）様式３－２－８－２","様式３－２－８（項目定義）","様式３－２－９","（回答不要）学校コード","Sheet2"],"not_rendered":{"charts":0,"images":2,"macros":1,"external_links":3,"defined_names":31,"comments":5,"pivot_tables":0},"unopened":[],"bounds":{"document_bytes":16777216,"sheet_cells":100000,"rows_first":2000,"rows_last":500,"rows_between":2000,"halvings":0,"cell_chars":16384,"cell_head_chars":4096},"cells_cut":0,"cells_raw":0,"read":"whole","date_system":"1900"}

{"sheet":"様式３－２－１（学校基本情報）","index":0,"n_rows":25,"n_cols":14,"rows_kept":25,"cut":false,"hidden":false,"merged":[[5,1,6,1],[21,1,21,4],[24,3,26,4],[15,1,15,4],[17,1,17,4],[20,1,20,4],[16,1,16,4],[18,1,18,4],[19,1,19,4]]}
["様式３－２－１",null,null,null,"【専修学校シート】"]
["（学校の基本情報について）",null,null,null,null,null,null,null,null,null,null,null,null,"学校法人"]
[null,null,null,null,null,null,"入力チェック",null,null,null,null,null,null,"私立学校法第64条第4項の法人（いわゆる準学校法人）"]
[null,"都道府県名 1)","03岩   手",null,null,null,{"$f":"IF(C4=\"\",\"エラー\",\"OK\")","v":"OK"},null,null,null,null,null,null,"財団法人立"]
[null,"設置者名 2)",null,null,null,null,{"$f":"IF(C5=\"\",\"エラー\",\"OK\")","v":"エラー"},null,null,null,null,null,null,"社団法人立"]
[null,"設置者の種別 3)",null,null,null,null,{"$f":"IF(C6=\"\",\"エラー\",\"OK\")","v":"エラー"},null,null,null,null,null,null,"株式会社立"]
[null,null,"（その他の法人の場合：　　　　　　　　　　　　　　　　　　　　）",null,null,null,{"$f":"IF(C6=N8,IF(C7=\"（その他の法人の場合：　　　　　　　　　　　　　　　　　　　　　　　　　　　　　　　　　　）\",\"エラー\",\"OK\"),\"OK\")","v":"OK"},null,null,null,null,null,null,"その他の法人立"]
[null,"学校名",null,null,null,null,{"$f":"IF(C8=\"\",\"エラー\",\"OK\")","v":"エラー"},null,null,null,null,null,null,"個人立"]
[null,"学校コード 4)",{"$f":"IFERROR(VLOOKUP(C8,'（回答不要）学校コード'!A3:C3053,2,FALSE),\"\")","v":""},null,null,null,{"$f":"IF(C9=\"\",\"エラー\",\"OK\")","v":"エラー"},null,null,null,null,null,null,"個人立"]
[null,"法人番号 5)",null,null,null,null,"エラー"]
[null,"担当者名 6)",null,null,null,null,"エラー"]
[null,"担当者の直通電話 6)",null,null,null,null,"エラー"]
[null,"担当者のemail 6)",null,null,null,null,"エラー"]
[]
["〔注〕"]
["１）","「都道府県」の欄は、プルダウンリストから選択してください。"]
["２）","いずれかの法人立の場合は法人名を記載してください。個人立の場合は設置者である個人名を記載してください。"]
["３）","「設置者の種別」は、プルダウンリストから選択してください。「その他の法人立」を選択した場合のみ、自由記述欄に法人の種別を具体的に記載してください。"]
["４）","「学校コード」は、学校名により自動転記されますが、されない場合は「（回答不要）学校コード」シート又は以下のホームページを参考に手動での記入をお願いします。半角数字13桁、ハイフン等無しで記載してください。"]
[null,"https://www.mext.go.jp/b_menu/toukei/mext_01087.html"]
["５）","「法人番号」は、以下のホームページで確認できる、13桁の番号です。半角数字13桁、ハイフン等無しで記載してください。"]
[null,"http://www.houjin-bangou.nta.go.jp/"]
["６）","担当者の欄は、事務担当者を記載してください。回答内容について、文部科学省から個別に連絡させていただくことがあります。"]
[]
[null,null,null,{"$f":"IF(COUNTIF(G4:G13,\"エラー\")=0,\"OK\",\"エラー\")","v":"エラー"}]

{"sheet":"様式３－２－２","index":1,"n_rows":39,"n_cols":20,"rows_kept":39,"cut":false,"hidden":false,"merged":[[9,24,10,25],[11,24,11,25],[12,24,12,25],[13,24,13,25],[9,20,10,21],[11,20,11,21],[13,20,13,21],[11,22,11,23],[9,22,10,23],[12,22,12,23],[13,22,13,23],[12,20,12,21],[9,17,10,17],[9,18,10,19],[11,10,11,11],[5,2,5,4],[9,2,10,3],[11,18,11,19],[9,4,10,5],[11,2,11,3],[5,5,5,8],[9,10,10,11],[31,18,32,18],[9,1,10,1],[12,4,12,5],[13,4,13,5],[10,6,10,9],[17,1,17,15],[22,1,22,15],[20,1,20,15],[13,2,13,3],[18,1,18,15],[19,1,19,15],[13,18,13,19],[13,10,13,11],[12,2,12,3],[12,18,12,19],[12,10,12,11],[24,10,26,11],[11,4,11,5],[6,2,6,3],[6,5,6,7],[9,6,9,9],[21,1,21,15]]}
["様式３－２－２",null,null,null,null,null,null,null,null,null,null,null,null,null,null,null,"【専修学校シート】"]
["（専修学校のカリキュラムについて）"]
[]
[]
[null,"履修証明プログラム 2)"]
[null,null,"年間受入人数（令和7年度間）",null,null,"年間実施プログラム数（令和7年度間）"]
[null,"専門課程",null,null,"人",null,null,null,"プログラム"]
[]
[null,"企業等との連携について"]
[null,null,"企業等と連携して実施する、企業の課題解決や製品開発等を題材とした授業科目の開設（ＰＢＬ）等 3)",null,"企業等からの\n講師派遣\n4)",null,"インターンシップ・企業内実習等 5)",null,null,null,"企業等と連携して\n教育課程を編成\n7)"]
[null,null,null,null,null,null,"年間実施総数（令和7年度間） 6)"]
[null,"高等課程",null,null,null,null,null,"学科",null,"人"]
[null,"専門課程",null,null,null,null,null,"学科",null,"人"]
[null,"一般課程",null,null,null,null,null,"学科",null,"人"]
[]
["〔注〕"]
["１）","黄色に着色されたセルについて記入してください。「0」を記入する必要はありません。"]
["２）","「履修証明プログラム」の項には、学校教育法第133条で準用する同法第105条に基づき、正規課程の生徒以外の者を対象とした特別の課程（60時間以上）を編成し、履修証明プログラムとして受け入れている生徒数・講座数を記入してください。\n「年間受入人数」は、１年に複数回受講生を受け入れる場合もあることから、昨年度の年間受入総数（のべ数）を記入してください。\n「年間実施プログラム数」は、実際に受講生を受け入れて実施したプログラムについて、昨年度の年間実施総数（のべ数）を記入してください。また、複数の講座等を組み合わせて受講するプログラムの場合は、セットで1つのプログラムとして計上してください。"]
["３）","「企業等と連携して実施する、企業の課題解決や製品開発等を題材とした授業科目」を実施している場合は「している」を選択してください。PBL（Project Based Learningの略）とは、問題解決型学習のことで、学習者が主体的に見つけた課題あるいは企業等から提示された課題の解決に向けて、グループワークあるいはワークショップ形式などで能動的に活動する学習のことをいいます。\n（例）企業内において行う演習授業等"]
["４）","「企業等からの講師派遣」の項には、企業等と協定書等（覚書や契約書等を含む）や講師契約等を締結することにより、当該企業等の役職員による実習・演習等を行っている場合に「している」を選択してください。企業等からの講師派遣であっても協定書等の締結が無い場合（協定書等の締結が無く、卒業生等に個別に依頼して講師として招く場合など）は含みません。"]
["５）","「インターンシップ・企業内実習等」とは、生徒が在学中に、企業等においてキャリアに関連した就業体験を行うことを指すものであり、企業内実習等を含みます。必修科目に限らず、選択科目等も含まれますが、単位として認められるものに限ります。また、特定の資格取得に向けて実施が法令義務となっている企業内実習（例えば、看護師免許を取得するために必修とされている現場実習としての看護実習等）も含めてください。"]
["６）","「年間実施総数」の人数の項では、インターンシップ等に参加したことがある経験者の人数を把握するものであるため、１人が学科をまたがって複数のインターンシップに参加した場合及び１人が同一の学科内において複数回インターンシップに参加した場合であっても、重複してカウントするのではなく、「１人」としてカウントしてください。なお、科目等履修生による参加は含みません。"]
["７）","「企業等と連携して教育課程を編成」の項には、企業等の役職員が構成員として参画した委員会や会議等を組織し、当該委員会等における意見を活用して教育課程の編成を行っている場合に「している」を選択してください。（職業実践専門課程の認定要件の１つである、いわゆる教育課程編成委員会を実施している場合も含まれます。）"]
[]
[null,null,null,null,null,null,null,null,null,null,{"$f":"IF(COUNTIF(R:Z,\"エラー\")=0,\"OK\",\"エラー\")","v":"OK"}]
[]
[]
[]
[null,null,null,null,null,null,null,null,null,null,{"$f":"IF(K25=\"エラー\",\"入力すべき項目の入力漏れ又は内数の方が多いなどの矛盾があると思われます。ご確認ください。\",\"\")","v":""}]
[null,null,null,null,null,null,null,null,null,null,null,null,null,null,null,null,null,null,"都道府県名 1)",{"$f":"'様式３－２－１（学校基本情報）'!C4","v":"03岩   手"}]
[null,null,null,null,null,null,null,null,null,null,null,null,null,null,null,null,null,null,"設置者名",{"$f":"'様式３－２－１（学校基本情報）'!C5","v":0}]
[null,null,null,null,null,null,null,null,null,null,null,null,null,null,null,null,null,null,"設置者の種別 2)",{"$f":"'様式３－２－１（学校基本情報）'!C6","v":0}]
[null,null,null,null,null,null,null,null,null,null,null,null,null,null,null,null,null,null,null,{"$f":"'様式３－２－１（学校基本情報）'!C7","v":"（その他の法人の場合：　　　　　　　　　　　　　　　　　　　　）"}]
[null,null,null,null,null,null,null,null,null,null,null,null,null,null,null,null,null,null,"学校名",{"$f":"'様式３－２－１（学校基本情報）'!C8","v":0}]
[null,null,null,null,null,null,null,null,null,null,null,null,null,null,null,null,null,null,"学校コード 3)",{"$f":"'様式３－２－１（学校基本情報）'!$C$9","v":""}]
[null,null,null,null,null,null,null,null,null,null,null,null,null,null,null,null,null,null,"法人番号 4)",{"$f":"'様式３－２－１（学校基本情報）'!C10","v":0}]
[null,null,null,null,null,null,null,null,null,null,null,null,null,null,null,null,null,null,"担当者名 5)",{"$f":"'様式３－２－１（学校基本情報）'!C11","v":0}]
[null,null,null,null,null,null,null,null,null,null,null,null,null,null,null,null,null,null,"担当者の直通電話",{"$f":"'様式３－２－１（学校基本情報）'!C12","v":0}]
[null,null,null,null,null,null,null,null,null,null,null,null,null,null,null,null,null,null,"担当者のemail",{"$f":"'様式３－２－１（学校基本情報）'!C13","v":0}]

{"sheet":"様式３－２－３","index":2,"n_rows":78,"n_cols":28,"rows_kept":78,"cut":false,"hidden":false,"merged":[[4,13,4,20],[6,16,6,17],[15,22,15,23],[21,27,21,28],[13,2,14,6],[16,2,16,3],[21,13,21,14],[20,11,20,12],[21,11,21,12],[17,13,17,14],[15,20,15,21],[15,18,15,19],[4,2,4,7],[7,5,7,6],[8,5,8,6],[6,29,6,30],[7,18,7,19],[8,18,8,19],[9,11,9,12],[20,29,20,30],[19,29,19,30],[16,27,16,28],[16,29,16,30],[20,13,20,14],[16,13,16,14],[5,18,6,20],[24,29,25,30],[27,1,27,25],[41,6,41,7],[41,8,41,9],[36,0,36,1],[34,8,34,9],[34,2,34,3],[34,4,34,5],[34,6,34,7],[33,0,33,8],[28,1,28,25],[29,1,29,25],[6,33,6,34],[7,33,9,34],[8,11,8,12],[6,31,6,32],[7,31,7,32],[8,31,8,32],[70,19,72,21],[17,31,17,32],[70,26,71,26],[32,1,32,24],[44,0,44,1],[30,1,30,25],[26,29,27,30],[21,29,21,30],[35,0,35,1],[18,27,19,28],[18,13,18,14],[19,13,19,14],[21,31,21,32],[43,0,43,1],[41,12,41,13],[41,14,41,15],[41,10,41,11],[19,31,19,32],[42,0,42,1],[37,0,37,1],[41,0,41,1],[41,2,41,3],[41,4,41,5],[24,27,25,28],[26,1,26,25],[41,16,41,17],[41,18,41,19],[41,20,41,21],[41,22,41,23],[38,0,38,1],[41,24,41,25],[31,1,31,25],[21,35,21,36],[18,35,18,36],[19,35,19,36],[20,35,20,36],[16,35,16,36],[21,33,21,34],[17,33,17,34],[17,35,17,36],[18,31,18,32],[16,31,16,32],[18,33,18,34],[19,33,19,34],[20,33,20,34],[20,31,20,32],[7,0,7,1],[8,0,8,1],[7,2,7,3],[8,2,8,3],[9,13,9,14],[16,33,16,34],[7,13,7,14],[8,13,8,14],[9,2,9,3],[9,18,9,19],[7,29,7,30],[8,29,8,30],[9,29,9,30],[7,11,7,12],[9,0,9,1],[13,13,13,25],[15,24,15,25],[14,13,15,14],[14,16,15,16],[9,31,9,32],[9,5,9,6]]}
["様式３－２－３",null,null,null,null,null,null,null,null,null,null,null,null,null,null,null,null,null,null,null,null,null,null,null,null,"【専修学校シート】"]
["（専修学校生の受入れについて）"]
[]
["●正規課程の在籍生徒数",null,null,null,null,null,null,null,null,null,null,"●科目等履修生の受入数・科目数 5)"]
[null,null,"令和8年５月1日時点在籍数",null,null,null,null,null,null,null,null,null,null,"年間実施数（令和7年度間）"]
[null,null,"総　数 3)",null,null,null,null,null,null,null,null,null,null,"年間受入人数 3)",null,null,null,null,"年間実施科目数"]
[null,null,null,null,null,"うち社会人 4)",null,null,null,null,null,null,null,null,null,null,"うち社会人 4)"]
["高等課程",null,null,null,"人",null,null,"人",null,null,null,"高等課程",null,null,null,"人",null,"人",null,null,"科目"]
["専門課程",null,null,null,"人",null,null,"人",null,null,null,"専門課程",null,null,null,"人",null,"人",null,null,"科目"]
["一般課程",null,null,null,"人",null,null,"人",null,null,null,"一般課程",null,null,null,"人",null,"人",null,null,"科目"]
[]
[]
["●附帯事業の受入数・講座数 6)",null,null,null,null,null,null,null,null,null,null,"●附帯事業の実施内訳"]
[null,null,"年間実施数（令和7年度間）",null,null,null,null,null,null,null,null,null,null,"年間実施数（令和7年度間）"]
[null,null,null,null,null,null,null,null,null,null,null,null,null,"講座数",null,null,"人数"]
[null,null,"年間受入人数 3)",null,null,"年間実施講座数",null,null,null,null,null,null,null,null,null,null,null,null,"就業者 9)",null,"退職者 9)",null,"主婦・主夫 9)",null,"その他 9)",null,null,"付帯事業の受入人数と内訳人数の合致"]
["附帯事業",null,{"$f":"Q22","v":0},{"$f":"L22","v":"総計"},"人",{"$f":"N22","v":0},"講座",null,null,null,null,"職業教育に関するもの ７)",null,{"$f":"N18+N19+N20","v":0},null,"講座",{"$f":"Q18+Q19+Q20","v":0},"人",{"$f":"S18+S19+S20","v":0},"人",{"$f":"U18+U19+U20","v":0},"人",{"$f":"W18+W19+W20","v":0},"人",{"$f":"Y18+Y19+Y20","v":0},"人",null,{"$f":"IF(Q17+Q21=C17,\"ＯＫ\",\"ＮＧ\")","v":"ＯＫ"}]
[null,null,null,null,null,null,null,null,null,null,null,null,"「公共職業訓練」（離職者訓練） ８）",null,null,"講座",{"$f":"S18+U18+W18+Y18","v":0},"人",null,"人",null,"人",null,"人",null,"人",null,"付帯事業の講座数と内訳講座数の合致"]
[null,null,null,null,null,null,null,null,null,null,null,null,"「求職者支援訓練」 ８）",null,null,"講座",{"$f":"S19+U19+W19+Y19","v":0},"人",null,"人",null,"人",null,"人",null,"人",null,{"$f":"IF(N17+N21=F17,\"ＯＫ\",\"ＮＧ\")","v":"ＯＫ"}]
[null,null,null,null,null,null,null,null,null,null,null,null,"その他 ８）",null,null,"講座",0,"人",null,"人",null,"人",null,"人",null,"人"]
[null,null,null,null,null,null,null,null,null,null,null,"職業教育に関しないもの　７）",null,null,null,"講座",0,"人",null,"人",null,"人",null,"人",null,"人"]
[null,null,null,null,null,null,null,null,null,null,null,"総計",null,{"$f":"N17+N21","v":0},null,"講座",0,"人",{"$f":"S17+S21","v":0},"人",{"$f":"U17+U21","v":0},"人",{"$f":"W17+W21","v":0},"人",{"$f":"Y17+Y21","v":0},"人"]
[]
["〔注〕"]
["1)","黄色に着色されたセルについて記入すること。「0」を記入する必要はありません。"]
["2)","「正規課程の在籍生徒数」、「科目等履修生の受入数」及び「附帯事業の受入数」には、それぞれ留学生の数も含めてください。"]
["3)","「正規課程の在籍生徒数」の「総数」及び「うち社会人」については、今年度の5月1日時点で在籍している者の総数を記入してください。\n科目等履修生及び附帯事業の「年間受入人数」については、昨年度の１年間に受講したことのある者の総数を記入してください。科目等履修や附帯事業では、１年に複数回受け入れる場合もあることから、１年間の受入総数（のべ人数）を記入してください。"]
["4)","「社会人」とは、①現に職に就いている者（給料、賃金、報酬、その他の経常的な収入を得る仕事に就いている者）、②給料、賃金、報酬、その他の経常的な収入を得る仕事から既に退職した者、③主婦・主夫をいいます。"]
["5)","「科目等履修生の受入数・科目数」の項には、専修学校設置基準第15条に基づき、正規課程に在籍する生徒以外に、正規課程の科目の一部を受講する科目等履修生として受け入れていた年間の総人数（のべ人数）及び実際に受け入れた実績のある科目総数を記入してください。"]
["6)","「附帯事業の受入数・講座数」の項には、附帯事業として位置づけている正規課程以外の教育事業に受け入れている年間の総人数（のべ人数）及び実際に受け入れた実績のある講座総数を記入してください。講座数については、一定のカリキュラムの修了を目的とした講座・プログラムを１単位として計上してください。\nなお、学校教育法第133条で準用する同法第105条に基づき実施する履修証明プログラムや、60時間未満の履修証明プログラム以外の教育事業で、附帯事業と位置づけている場合は対象に含まれます。"]
["7)","「職業教育に関するもの」とは、主に職業に就くことを目的とする教育等をいいます。「職業教育に関しないもの」とは、予備校や教養教育等をいいます。\n「職業教育に関するもの」の合計人数・合計講座数と「職業教育に関しないもの」の合計人数・合計講座数の総計が、「附帯事業の受入数・講座数」の「年間受入人数」及び「年間実施講座数」の数値と一致するよう留意してください。"]
["8)","「公共職業訓練」（離職者訓練）とは、職業能力開発促進法に基づき、国及び都道府県が行う公共職業訓練について、その一部を専修学校等の民間教育訓練機関に委託して実施するものをいいます。\n「求職者支援訓練」とは、求職者支援法に基づき、厚生労働省から認定された求職者支援訓練をいいます。\n「その他」とは、上記以外の附帯事業として位置づけている正規課程以外の教育事業を計上してください。"]
["9)","「就業者」とは、「社会人」のうち、現に職に就いている者（給料、賃金、報酬、その他の経常的な収入を得る仕事に就いている者）をいいます。（注4)の①にあたる者）\n「退職者」とは、「社会人」のうち、給料、賃金、報酬、その他の経常的な収入を得る仕事から既に退職した者をいいます。（注4)の②にあたる者）\n「主婦・主夫」とは、「社会人」のうち、主婦・主夫をいいます。（注4)の③にあたる者）\n「その他」には、上記以外の者を計上してください。"]
["●今年度の入学者の出身地"]
[null,null,"自県出身者数",null,"他県等出身者数",null,"海外出身者数\n（留学生含む）",null,"入学者総計"]
["高等課程",null,null,"人",null,"人",null,"人",{"$f":"SUM(C36,E36,G36)","v":0},"人"]
["専門課程",null,null,"人",null,"人",null,"人",{"$f":"SUM(C37,E37,G37)","v":0},"人"]
["一般課程",null,null,"人",null,"人",null,"人",{"$f":"SUM(C38,E38,G38)","v":0},"人"]
["合計",null,{"$f":"SUM(C36:C38)","v":0},"人",{"$f":"SUM(E36:E38)","v":0},"人",{"$f":"SUM(G36:G38)","v":0},"人",{"$f":"SUM(I36+I37+I38)","v":0},"人"]
[]
["●在籍生徒の最終学歴"]
[null,null,"計",null,"中学校\n卒業",null,"高等学校\n中退",null,"高等学校\n卒業",null,"高等課程\n卒業",null,"高等専門学校\n卒業",null,"短期大学\n卒業",null,"大学卒業",null,"大学\n中退",null,"専門課程\n卒業",null,"高卒認定試験\n合格",null,"その他 1)"]
["高等課程",null,{"$f":"SUM(E43:Z43)","v":0},"人",null,"人",null,"人",null,"人",null,"人",null,"人",null,"人",null,"人",null,"人",null,"人",null,"人",null,"人"]
["専門課程",null,{"$f":"SUM(I44:Z44)","v":0},"人",null,"人",null,"人",null,"人",null,"人",null,"人",null,"人",null,"人",null,"人",null,"人",null,"人",null,"人"]
["一般課程",null,{"$f":"SUM(E45:Z45)","v":0},"人",null,"人",null,"人",null,"人",null,"人",null,"人",null,"人",null,"人",null,"人",null,"人",null,"人",null,"人"]
[]
["〔注〕"]
["1)","「その他」には、上記表に記載する最終学歴以外で、下記に掲げるいずれかの学歴を有し、各課程に入学した者を記載してください。"]
[]
[]
[]
[]
[]
[]
[]
[]
[]
[]
[]
[]
[]
[]
[]
[]
[]
[]
[]
[]
[null,null,null,null,null,null,null,null,null,null,null,null,null,null,null,null,null,null,null,null,null,null,null,null,null,null,"都道府県名 1)",{"$f":"'様式３－２－１（学校基本情報）'!$C$4","v":"03岩   手"}]
[null,null,null,null,null,null,null,null,null,null,null,null,null,null,null,null,null,null,null,null,null,null,null,null,null,null,"設置者名",{"$f":"'様式３－２－１（学校基本情報）'!$C$5","v":0}]
[null,null,null,null,null,null,null,null,null,null,null,null,null,null,null,null,null,null,null,{"$f":"IF(COUNTIF(AD:AO,\"エラー\")=0,\"OK\",\"エラー\")","v":"OK"},null,null,null,null,null,null,"設置者の種別 2)",{"$f":"'様式３－２－１（学校基本情報）'!$C$6","v":0}]
[null,null,null,null,null,null,null,null,null,null,null,null,null,null,null,null,null,null,null,null,null,null,null,null,null,null,null,{"$f":"'様式３－２－１（学校基本情報）'!$C$7","v":"（その他の法人の場合：　　　　　　　　　　　　　　　　　　　　）"}]
[null,null,null,null,null,null,null,null,null,null,null,null,null,null,null,null,null,null,null,null,null,null,null,null,null,null,"学校名",{"$f":"'様式３－２－１（学校基本情報）'!$C$8","v":0}]
[null,null,null,null,null,null,null,null,null,null,null,null,null,null,null,null,null,null,null,null,null,null,null,null,null,null,"学校コード 3)",{"$f":"'様式３－２－１（学校基本情報）'!$C$9","v":""}]
[null,null,null,null,null,null,null,null,null,null,null,null,null,null,null,null,null,null,null,null,null,null,null,null,null,null,"法人番号 4)",{"$f":"'様式３－２－１（学校基本情報）'!$C$10","v":0}]
[null,null,null,null,null,null,null,null,null,null,null,null,null,null,null,null,null,null,null,null,null,null,null,null,null,null,"担当者名 5)",{"$f":"'様式３－２－１（学校基本情報）'!$C$11","v":0}]
[null,null,null,null,null,null,null,null,null,null,null,null,null,null,null,null,null,null,null,null,null,null,null,null,null,null,"担当者の直通電話",{"$f":"'様式３－２－１（学校基本情報）'!$C$12","v":0}]
[null,null,null,null,null,null,null,null,null,null,null,null,null,null,null,null,null,null,null,null,null,null,null,null,null,null,"担当者のemail",{"$f":"'様式３－２－１（学校基本情報）'!$C$13","v":0}]

{"sheet":"様式３－２－４","index":3,"n_rows":54,"n_cols":46,"rows_kept":54,"cut":false,"hidden":false,"merged":[[40,1,40,42],[4,22,5,24],[4,25,5,27],[46,44,47,44],[39,1,39,42],[35,1,35,39],[37,1,37,42],[38,1,38,42],[8,17,8,18],[11,2,11,3],[10,2,10,3],[8,7,8,8],[8,2,8,3],[8,4,8,5],[9,17,9,18],[9,2,9,3],[9,7,9,8],[8,12,8,13],[9,12,9,13],[9,25,9,26],[9,28,9,29],[8,22,8,23],[8,25,8,26],[9,22,9,23],[2,34,2,38],[3,22,3,39],[4,7,4,11],[3,1,5,3],[3,4,5,6],[5,10,5,11],[5,15,5,16],[5,20,5,21],[3,7,3,21],[4,12,4,16],[4,17,4,21],[4,28,5,30],[4,31,5,33],[4,34,5,36],[4,37,5,39],[7,2,7,3],[6,12,6,13],[7,4,7,5],[7,7,7,8],[7,17,7,18],[7,12,7,13],[7,22,7,23],[6,25,6,26],[6,22,6,23],[6,1,6,3],[6,4,6,5],[7,25,7,26],[6,7,6,8],[6,17,6,18],[8,28,8,29],[6,37,6,38],[6,28,6,29],[3,40,5,42],[10,17,10,18],[10,22,10,23],[10,25,10,26],[10,28,10,29],[9,31,9,32],[10,31,10,32],[6,40,6,41],[6,31,6,32],[8,34,8,35],[8,37,8,38],[8,40,8,41],[7,40,7,41],[7,37,7,38],[7,34,7,35],[8,31,8,32],[7,31,7,32],[7,28,7,29],[9,40,9,41],[6,34,6,35],[9,4,9,5],[10,34,10,35],[10,37,10,38],[10,12,10,13],[10,40,10,41],[11,4,11,5],[11,7,11,8],[11,17,11,18],[11,22,11,23],[11,25,11,26],[11,28,11,29],[11,37,11,38],[10,4,10,5],[10,7,10,8],[11,40,11,41],[11,31,11,32],[11,34,11,35],[12,40,12,41],[14,40,14,41],[14,2,14,3],[12,2,12,3],[13,34,13,35],[13,37,13,38],[13,40,13,41],[14,4,14,5],[14,7,14,8],[14,17,14,18],[14,22,14,23],[13,31,13,32],[13,12,13,13],[13,4,13,5],[14,25,14,26],[14,28,14,29],[12,31,12,32],[12,34,12,35],[12,37,12,38],[14,31,14,32],[14,34,14,35],[13,17,13,18],[14,37,14,38],[12,12,12,13],[13,2,13,3],[13,7,13,8],[15,34,15,35],[15,37,15,38],[15,1,15,3],[15,4,15,5],[15,7,15,8],[15,17,15,18],[15,22,15,23],[15,25,15,26],[15,28,15,29],[12,28,12,29],[13,22,13,23],[13,25,13,26],[13,28,13,29],[12,4,12,5],[12,7,12,8],[12,17,12,18],[12,22,12,23],[12,25,12,26],[16,37,16,38],[16,40,16,41],[9,34,9,35],[9,37,9,38],[17,2,17,3],[17,4,17,5],[17,7,17,8],[17,17,17,18],[17,22,17,23],[15,31,15,32],[17,25,17,26],[17,28,17,29],[17,31,17,32],[17,34,17,35],[17,37,17,38],[17,40,17,41],[15,40,15,41],[16,2,16,3],[16,4,16,5],[16,7,16,8],[16,17,16,18],[16,22,16,23],[16,25,16,26],[16,28,16,29],[16,31,16,32],[16,34,16,35],[19,22,19,23],[18,2,18,3],[18,4,18,5],[18,7,18,8],[18,17,18,18],[18,22,18,23],[19,12,19,13],[18,12,18,13],[18,28,18,29],[18,31,18,32],[18,34,18,35],[18,37,18,38],[18,40,18,41],[18,25,18,26],[19,28,19,29],[19,31,19,32],[19,34,19,35],[19,37,19,38],[20,25,20,26],[19,40,19,41],[20,28,20,29],[20,31,20,32],[20,34,20,35],[20,37,20,38],[20,40,20,41],[20,2,20,3],[20,4,20,5],[20,7,20,8],[20,17,20,18],[20,22,20,23],[19,25,19,26],[19,2,19,3],[19,4,19,5],[19,7,19,8],[19,17,19,18],[22,25,22,26],[21,40,21,41],[22,2,22,3],[22,4,22,5],[22,7,22,8],[22,17,22,18],[22,22,22,23],[21,25,21,26],[22,28,22,29],[22,31,22,32],[22,34,22,35],[22,37,22,38],[22,40,22,41],[21,2,21,3],[21,4,21,5],[21,7,21,8],[21,17,21,18],[21,22,21,23],[21,28,21,29],[21,31,21,32],[21,34,21,35],[21,37,21,38],[24,25,24,26],[23,40,23,41],[24,1,24,3],[24,4,24,5],[24,7,24,8],[24,17,24,18],[24,22,24,23],[23,25,23,26],[24,28,24,29],[24,31,24,32],[24,34,24,35],[24,37,24,38],[24,40,24,41],[23,2,23,3],[23,4,23,5],[23,7,23,8],[23,17,23,18],[23,22,23,23],[23,28,23,29],[23,31,23,32],[23,34,23,35],[23,37,23,38],[26,2,26,3],[26,4,26,5],[26,7,26,8],[26,17,26,18],[26,22,26,23],[25,25,25,26],[26,12,26,13],[26,40,26,41],[25,2,25,3],[25,4,25,5],[25,7,25,8],[25,17,25,18],[25,22,25,23],[25,28,25,29],[25,31,25,32],[25,34,25,35],[25,37,25,38],[27,34,27,35],[27,37,27,38],[27,12,27,13],[28,12,28,13],[26,25,26,26],[25,40,25,41],[26,28,26,29],[26,31,26,32],[26,34,26,35],[26,37,26,38],[29,28,29,29],[29,31,29,32],[29,34,29,35],[29,37,29,38],[29,12,29,13],[27,40,27,41],[28,2,28,3],[28,4,28,5],[28,7,28,8],[28,17,28,18],[28,22,28,23],[27,25,27,26],[28,28,28,29],[28,31,28,32],[28,34,28,35],[28,37,28,38],[28,40,28,41],[27,2,27,3],[27,4,27,5],[27,7,27,8],[27,17,27,18],[27,22,27,23],[27,28,27,29],[27,31,27,32],[30,4,30,5],[30,7,30,8],[30,17,30,18],[30,22,30,23],[29,25,29,26],[30,12,30,13],[29,2,29,3],[29,4,29,5],[29,7,29,8],[29,17,29,18],[29,22,29,23],[41,1,41,42],[36,1,36,42],[32,25,32,26],[32,31,32,32],[32,34,32,35],[11,12,11,13],[14,12,14,13],[15,12,15,13],[16,12,16,13],[17,12,17,13],[32,37,32,38],[32,28,32,29],[20,12,20,13],[21,12,21,13],[22,12,22,13],[23,12,23,13],[24,12,24,13],[25,12,25,13],[30,31,30,32],[30,34,30,35],[31,2,31,3],[30,25,30,26],[29,40,29,41],[30,2,30,3],[42,1,42,42],[44,1,44,42],[28,25,28,26],[31,40,31,41],[32,2,32,3],[32,4,32,5],[32,7,32,8],[32,12,32,13],[32,17,32,18],[32,22,32,23],[32,40,32,41],[30,28,30,29],[31,4,31,5],[31,7,31,8],[31,17,31,18],[31,22,31,23],[31,25,31,26],[31,12,31,13],[30,37,30,38],[30,40,30,41],[31,34,31,35],[31,37,31,38],[31,28,31,29],[31,31,31,32]]}
["様式３－２－４",null,null,null,null,null,null,null,null,null,null,null,null,null,null,null,null,null,null,null,null,null,null,null,null,null,null,null,null,null,null,null,null,null,null,null,null,null,null,null,null,null,"【専修学校シート】"]
["（専修学校生の卒業について）"]
[]
[null,"課程",null,null,"卒業した者の数",null,null,"うち就職者等の数",null,null,null,null,null,null,null,null,null,null,null,null,null,null,"うち進学者数 7)",null,null,null,null,null,null,null,null,null,null,null,null,null,null,null,null,null,"左記以外の者"]
[null,null,null,null,null,null,null,"就職者 3)\n（正規の職員等4)）",null,null,null,null,"就職者 3)\n（正規の職員等でない者5)）",null,null,null,null,"一時的な仕事についた者 6)",null,null,null,null,"大学",null,null,"短期大学",null,null,"高等専門学校",null,null,"専門学校",null,null,"大学院",null,null,"その他"]
[null,null,null,null,null,null,null,null,null,null,"うち県内\n就職者 7)",null,null,null,null,"うち県内\n就職者 7)",null,null,null,null,"うち県内\n就職者 7)"]
[null,"高等課程",null,null,{"$f":"SUM(E8:F15)","v":0},null,"人",{"$f":"SUM(H8:I15)","v":0},null,"人",{"$f":"SUM(K8:K15)","v":0},"人",{"$f":"SUM(M8:N15)","v":0},null,"人",{"$f":"SUM(P8:P15)","v":0},"人",{"$f":"SUM(R8:S15)","v":0},null,"人",{"$f":"SUM(U8:U15)","v":0},"人",{"$f":"SUM(W8:X15)","v":0},null,"人",{"$f":"SUM(Z8:AA15)","v":0},null,"人",{"$f":"SUM(AC8:AD15)","v":0},null,"人",{"$f":"SUM(AF8:AG15)","v":0},null,"人",{"$f":"SUM(AI8:AJ15)","v":0},null,"人",{"$f":"SUM(AL8:AM15)","v":0},null,"人",{"$f":"SUM(AO8:AP15)","v":0},null,"人"]
[null,null,"うち工業分野",null,{"$f":"SUM(H8,M8,R8,W8,Z8,AC8,AF8,AI8,AL8,AO8)","v":0},null,"人",null,null,"人",null,"人",null,null,"人",null,"人",null,null,"人",null,"人",null,null,"人",null,null,"人",null,null,"人",null,null,"人",null,null,"人",null,null,"人",null,null,"人"]
[null,null,"うち農業分野",null,0,null,"人",null,null,"人",null,"人",null,null,"人",null,"人",null,null,"人",null,"人",null,null,"人",null,null,"人",null,null,"人",null,null,"人",null,null,"人",null,null,"人",null,null,"人"]
[null,null,"うち医療分野",null,0,null,"人",null,null,"人",null,"人",null,null,"人",null,"人",null,null,"人",null,"人",null,null,"人",null,null,"人",null,null,"人",null,null,"人",null,null,"人",null,null,"人",null,null,"人"]
[null,null,"うち衛生分野",null,0,null,"人",null,null,"人",null,"人",null,null,"人",null,"人",null,null,"人",null,"人",null,null,"人",null,null,"人",null,null,"人",null,null,"人",null,null,"人",null,null,"人",null,null,"人"]
[null,null,"うち教育・社会福祉分野",null,0,null,"人",null,null,"人",null,"人",null,null,"人",null,"人",null,null,"人",null,"人",null,null,"人",null,null,"人",null,null,"人",null,null,"人",null,null,"人",null,null,"人",null,null,"人"]
[null,null,"うち商業実務分野",null,0,null,"人",null,null,"人",null,"人",null,null,"人",null,"人",null,null,"人",null,"人",null,null,"人",null,null,"人",null,null,"人",null,null,"人",null,null,"人",null,null,"人",null,null,"人"]
[null,null,"うち服飾・家政分野",null,0,null,"人",null,null,"人",null,"人",null,null,"人",null,"人",null,null,"人",null,"人",null,null,"人",null,null,"人",null,null,"人",null,null,"人",null,null,"人",null,null,"人",null,null,"人"]
[null,null,"うち文化・教養分野",null,0,null,"人",null,null,"人",null,"人",null,null,"人",null,"人",null,null,"人",null,"人",null,null,"人",null,null,"人",null,null,"人",null,null,"人",null,null,"人",null,null,"人",null,null,"人"]
[null,"専門課程",null,null,{"$f":"SUM(E17:F24)","v":0},null,"人",{"$f":"SUM(H17:I24)","v":0},null,"人",{"$f":"SUM(K17:K24)","v":0},"人",{"$f":"SUM(M17:N24)","v":0},null,"人",{"$f":"SUM(P17:P24)","v":0},"人",{"$f":"SUM(R17:S24)","v":0},null,"人",{"$f":"SUM(U17:U24)","v":0},"人",{"$f":"SUM(W17:X24)","v":0},null,"人",{"$f":"SUM(Z17:AA24)","v":0},null,"人",{"$f":"SUM(AC17:AD24)","v":0},null,"人",{"$f":"SUM(AF17:AG24)","v":0},null,"人",{"$f":"SUM(AI17:AJ24)","v":0},null,"人",{"$f":"SUM(AL17:AM24)","v":0},null,"人",{"$f":"SUM(AO17:AP24)","v":0},null,"人"]
[null,null,"うち工業分野",null,{"$f":"SUM(H17,M17,R17,W17,Z17,AC17,AF17,AI17,AL17,AO17)","v":0},null,"人",null,null,"人",null,"人",null,null,"人",null,"人",null,null,"人",null,"人",null,null,"人",null,null,"人",null,null,"人",null,null,"人",null,null,"人",null,null,"人",null,null,"人"]
[null,null,"うち農業分野",null,0,null,"人",null,null,"人",null,"人",null,null,"人",null,"人",null,null,"人",null,"人",null,null,"人",null,null,"人",null,null,"人",null,null,"人",null,null,"人",null,null,"人",null,null,"人"]
[null,null,"うち医療分野",null,0,null,"人",null,null,"人",null,"人",null,null,"人",null,"人",null,null,"人",null,"人",null,null,"人",null,null,"人",null,null,"人",null,null,"人",null,null,"人",null,null,"人",null,null,"人"]
[null,null,"うち衛生分野",null,0,null,"人",null,null,"人",null,"人",null,null,"人",null,"人",null,null,"人",null,"人",null,null,"人",null,null,"人",null,null,"人",null,null,"人",null,null,"人",null,null,"人",null,null,"人"]
[null,null,"うち教育・社会福祉分野",null,0,null,"人",null,null,"人",null,"人",null,null,"人",null,"人",null,null,"人",null,"人",null,null,"人",null,null,"人",null,null,"人",null,null,"人",null,null,"人",null,null,"人",null,null,"人"]
[null,null,"うち商業実務分野",null,0,null,"人",null,null,"人",null,"人",null,null,"人",null,"人",null,null,"人",null,"人",null,null,"人",null,null,"人",null,null,"人",null,null,"人",null,null,"人",null,null,"人",null,null,"人"]
[null,null,"うち服飾・家政分野",null,0,null,"人",null,null,"人",null,"人",null,null,"人",null,"人",null,null,"人",null,"人",null,null,"人",null,null,"人",null,null,"人",null,null,"人",null,null,"人",null,null,"人",null,null,"人"]
[null,null,"うち文化・教養分野",null,0,null,"人",null,null,"人",null,"人",null,null,"人",null,"人",null,null,"人",null,"人",null,null,"人",null,null,"人",null,null,"人",null,null,"人",null,null,"人",null,null,"人",null,null,"人"]
[null,"一般課程",null,null,{"$f":"SUM(E26:F33)","v":0},null,"人",{"$f":"SUM(H26:I33)","v":0},null,"人",{"$f":"SUM(K26:K33)","v":0},"人",{"$f":"SUM(M26:N33)","v":0},null,"人",{"$f":"SUM(P26:P33)","v":0},"人",{"$f":"SUM(R26:S33)","v":0},null,"人",{"$f":"SUM(U26:U33)","v":0},"人",{"$f":"SUM(W26:X33)","v":0},null,"人",{"$f":"SUM(Z26:AA33)","v":0},null,"人",{"$f":"SUM(AC26:AD33)","v":0},null,"人",{"$f":"SUM(AF26:AG33)","v":0},null,"人",{"$f":"SUM(AI26:AJ33)","v":0},null,"人",{"$f":"SUM(AL26:AM33)","v":0},null,"人",{"$f":"SUM(AO26:AP33)","v":0},null,"人"]
[null,null,"うち工業分野",null,{"$f":"SUM(H26,M26,R26,W26,Z26,AC26,AF26,AI26,AL26,AO26)","v":0},null,"人",null,null,"人",null,"人",null,null,"人",null,"人",null,null,"人",null,"人",null,null,"人",null,null,"人",null,null,"人",null,null,"人",null,null,"人",null,null,"人",null,null,"人"]
[null,null,"うち農業分野",null,0,null,"人",null,null,"人",null,"人",null,null,"人",null,"人",null,null,"人",null,"人",null,null,"人",null,null,"人",null,null,"人",null,null,"人",null,null,"人",null,null,"人",null,null,"人"]
[null,null,"うち医療分野",null,0,null,"人",null,null,"人",null,"人",null,null,"人",null,"人",null,null,"人",null,"人",null,null,"人",null,null,"人",null,null,"人",null,null,"人",null,null,"人",null,null,"人",null,null,"人"]
[null,null,"うち衛生分野",null,0,null,"人",null,null,"人",null,"人",null,null,"人",null,"人",null,null,"人",null,"人",null,null,"人",null,null,"人",null,null,"人",null,null,"人",null,null,"人",null,null,"人",null,null,"人"]
[null,null,"うち教育・社会福祉分野",null,0,null,"人",null,null,"人",null,"人",null,null,"人",null,"人",null,null,"人",null,"人",null,null,"人",null,null,"人",null,null,"人",null,null,"人",null,null,"人",null,null,"人",null,null,"人"]
[null,null,"うち商業実務分野",null,0,null,"人",null,null,"人",null,"人",null,null,"人",null,"人",null,null,"人",null,"人",null,null,"人",null,null,"人",null,null,"人",null,null,"人",null,null,"人",null,null,"人",null,null,"人"]
[null,null,"うち服飾・家政分野",null,0,null,"人",null,null,"人",null,"人",null,null,"人",null,"人",null,null,"人",null,"人",null,null,"人",null,null,"人",null,null,"人",null,null,"人",null,null,"人",null,null,"人",null,null,"人"]
[null,null,"うち文化・教養分野",null,0,null,"人",null,null,"人",null,"人",null,null,"人",null,"人",null,null,"人",null,"人",null,null,"人",null,null,"人",null,null,"人",null,null,"人",null,null,"人",null,null,"人",null,null,"人"]
["〔注〕"]
["１）","黄色に着色されたセルについて記入すること。「0」を記入する必要はありません。"]
["２）","各項とも令和7年度卒業生に関する、令和8年５月1日現在の状況を記入してください。"]
["３）","「就職者」とは、給料、賃金、利潤、報酬その他の経常的な収入を得る仕事（自家・自営業を含む）に就いている者をいいます。家事手伝い、一時的な仕事に就いた者は除いてください。"]
["４）","「就職者」のうち「正規の職員等」とは、正規の職員・従業員、自営業主等をいいます。このうち、「正規の職員・従業員」とは、雇用の期間の定めのないものとして就職した者、「自営業主等」とは、個人経営の事業を営んでいる者及び家族の営む事業に継続的に本業として従事する者をいいます。"]
["５）","「就職者」のうち「正規の職員等でない者」とは、雇用の期間が１年以上で期間の定めのある者であり、かつ１週間の所定の労働時間がおおむね４０～３０時間程度の者をいいます。"]
["６）","「一時的な仕事についた者」とは、臨時的な収入を得る仕事に就いた者であり、雇用の期間が１年未満又は雇用期間の長さにかかわらず短時間勤務（おおむね３０～４０時間程度）の者をいいます。（例：アルバイト、パート等）"]
["７）","「県内就職者」とは、生徒の出身地にかかわらず、卒業後学校が所在する都道府県内に就職（内定）した者をいいます。"]
["８）","専門職大学は「大学」に、専門職短期大学は「短期大学」に、専門職大学院は「大学院」にそれぞれ計上してください。"]
["９）","労働者派遣法に基づく派遣労働者は、４）「正規の職員等」には計上せず、それぞれの区分に応じて、５）「正規の職員等でない者」又は６）「一時的な仕事に就いた者」に計上してください。"]
[]
[null,null,null,null,null,null,null,null,null,null,null,null,null,null,null,null,null,null,null,null,null,null,null,null,null,null,null,null,null,null,null,null,null,null,null,null,null,null,null,null,null,null,null,null,"都道府県名 1)",{"$f":"'様式３－２－１（学校基本情報）'!$C$4","v":"03岩   手"}]
[null,null,null,null,null,null,null,null,null,null,null,null,null,null,null,null,null,null,null,null,null,null,null,null,null,null,null,null,null,null,null,null,null,null,null,null,null,null,null,null,null,null,null,null,"設置者名",{"$f":"'様式３－２－１（学校基本情報）'!$C$5","v":0}]
[null,null,null,null,null,null,null,null,null,null,null,null,null,null,null,null,null,null,null,null,null,null,null,null,null,null,null,null,null,null,null,null,null,null,null,null,null,null,null,null,null,null,null,null,"設置者の種別 2)",{"$f":"'様式３－２－１（学校基本情報）'!$C$6","v":0}]
[null,null,null,null,null,null,null,null,null,null,null,null,null,null,null,null,null,null,null,null,null,null,null,null,null,null,null,null,null,null,null,null,null,null,null,null,null,null,null,null,null,null,null,null,null,{"$f":"'様式３－２－１（学校基本情報）'!$C$7","v":"（その他の法人の場合：　　　　　　　　　　　　　　　　　　　　）"}]
[null,null,null,null,null,null,null,null,null,null,null,null,null,null,null,null,null,null,null,null,null,null,null,null,null,null,null,null,null,null,null,null,null,null,null,null,null,null,null,null,null,null,null,null,"学校名",{"$f":"'様式３－２－１（学校基本情報）'!$C$8","v":0}]
[null,null,null,null,null,null,null,null,null,null,null,null,null,null,null,null,null,null,null,null,null,null,null,null,null,null,null,null,null,null,null,null,null,null,null,null,null,null,null,null,null,null,null,null,"学校コード",{"$f":"'様式３－２－１（学校基本情報）'!$C$9","v":""}]
[null,null,null,null,null,null,null,null,null,null,null,null,null,null,null,null,null,null,null,null,null,null,null,null,null,null,null,null,null,null,null,null,null,null,null,null,null,null,null,null,null,null,null,null,"法人番号 4)",{"$f":"'様式３－２－１（学校基本情報）'!$C$10","v":0}]
[null,null,null,null,null,null,null,null,null,null,null,null,null,null,null,null,null,null,null,null,null,null,null,null,null,null,null,null,null,null,null,null,null,null,null,null,null,null,null,null,null,null,null,null,"担当者名 5)",{"$f":"'様式３－２－１（学校基本情報）'!$C$11","v":0}]
[null,null,null,null,null,null,null,null,null,null,null,null,null,null,null,null,null,null,null,null,null,null,null,null,null,null,null,null,null,null,null,null,null,null,null,null,null,null,null,null,null,null,null,null,"担当者の直通電話",{"$f":"'様式３－２－１（学校基本情報）'!$C$12","v":0}]
[null,null,null,null,null,null,null,null,null,null,null,null,null,null,null,null,null,null,null,null,null,null,null,null,null,null,null,null,null,null,null,null,null,null,null,null,null,null,null,null,null,null,null,null,"担当者のemail",{"$f":"'様式３－２－１（学校基本情報）'!$C$13","v":0}]

{"sheet":"様式３－２－５","index":4,"n_rows":40,"n_cols":22,"rows_kept":40,"cut":false,"hidden":false,"merged":[[18,1,18,19],[32,20,33,20],[22,1,22,19],[4,5,4,6],[4,9,4,10],[4,13,4,14],[10,11,10,14],[11,11,11,12],[12,11,12,12],[13,11,13,12],[23,1,23,19],[14,11,14,12],[3,0,3,18],[6,0,6,2],[7,0,7,2],[8,0,8,2],[4,17,4,18],[4,11,4,12],[4,15,4,16]]}
["様式３－２－５",null,null,null,null,null,null,null,null,null,null,null,null,null,null,null,null,null,null,null,"【専修学校シート】"]
["（専修学校における障害のある生徒について）"]
[]
["障害のある生徒 3) "]
[null,null,null,"視覚障害",null,"聴覚・言語障害",null,"肢体不自由",null,"病弱・虚弱",null,"発達障害 5)\n（診断書有り）",null,"精神障害6)",null,"その他の障害 7)",null,"計"]
["高等課程",null,null,null,"人",null,"人",null,"人",null,"人",null,"人",null,"人",null,"人",{"$f":"SUM(D6,F6,H6,J6,L6,N6,P6)","v":0},"人"]
["専門課程",null,null,null,"人",null,"人",null,"人",null,"人",null,"人",null,"人",null,"人",{"$f":"SUM(D7,F7,H7,J7,L7,N7,P7)","v":0},"人"]
["一般課程",null,null,null,"人",null,"人",null,"人",null,"人",null,"人",null,"人",null,"人",{"$f":"SUM(D8,F8,H8,J8,L8,N8,P8)","v":0},"人"]
["合計",null,null,{"$f":"SUM(D6+D7+D8)","v":0},"人",{"$f":"SUM(F6+F7+F8)","v":0},"人",{"$f":"SUM(H6+H7+H8)","v":0},"人",{"$f":"SUM(J6+J7+J8)","v":0},"人",{"$f":"SUM(L6+L7+L8)","v":0},"人",{"$f":"SUM(N6+N7+N8)","v":0},"人",{"$f":"SUM(P6+P7+P8)","v":0},"人",{"$f":"SUM(D9,F9,H9,J9,L9,N9,P9)","v":0},"人"]
[null,null,null,null,null,null,null,null,null,null,null,"↓診断書が「ない」場合"]
[null,null,null,null,null,null,null,null,null,null,null,"発達障害が疑われる生徒 8)"]
[null,null,null,null,null,null,null,null,null,null,null,"高等課程",null,null,"人"]
[null,null,null,null,null,null,null,null,null,null,null,"専門課程",null,null,"人"]
[null,null,null,null,null,null,null,null,null,null,null,"一般課程",null,null,"人"]
[null,null,null,null,null,null,null,null,null,null,null,"合計",null,{"$f":"SUM(N12+N13+N14)","v":0},"人"]
["〔注〕"]
["１）","黄色に着色されたセルについて記入すること。「0」を記入する必要はありません。"]
["２）","各項とも、令和8年５月1日現在、在籍していた全ての「障害のある生徒」の数を記入してください。"]
["３）","「障害のある生徒」とは、障害者手帳（身体障害者手帳、精神障害者保健福祉手帳、療育手帳）を有している生徒又は健康診断等において障害があることが明らかになった生徒（重複する場合は実数）をいいます。"]
["４）","障害が重複している場合には、特に支援が必要な障害でカウントしてください（重複カウントなし）。"]
["５）","「発達障害」は、医師の診断書がある場合をいいます。"]
["６）","「精神障害」は、統合失調症、気分障害、神経症性障害、摂食障害、睡眠酒害等を含みます。"]
["７）","「その他の障害」とは、「障害のある生徒」のうち、視覚障害、聴覚・言語障害、肢体不自由、病弱・虚弱、重複、発達障害及び精神障害に該当しない障害があり、医師の診断書がある者又は、健康診断等において上記の障害があることが明らかになった者をいいます。"]
["８）","「発達障害が疑われる生徒」とは、発達障害であるとの医師の診断書はないが、発達障害があることが推察され、学校が何らかの支援（別紙参照）を行っている生徒をいいます。"]
["９）","各障害種の定義について判断に迷う場合には、【別添】を参照してください。"]
[]
[]
[]
[]
[]
[null,null,null,null,null,null,null,null,null,null,null,null,null,null,null,null,null,null,null,null,"都道府県名 1)",{"$f":"'様式３－２－１（学校基本情報）'!$C$4","v":"03岩   手"}]
[null,null,null,null,null,null,null,null,null,null,null,null,null,null,null,null,null,null,null,null,"設置者名",{"$f":"'様式３－２－１（学校基本情報）'!$C$5","v":0}]
[null,null,null,null,null,null,null,null,null,null,null,null,null,null,null,null,null,null,null,null,"設置者の種別 2)",{"$f":"'様式３－２－１（学校基本情報）'!$C$6","v":0}]
[null,null,null,null,null,null,null,null,null,null,null,null,null,null,null,null,null,null,null,null,null,{"$f":"'様式３－２－１（学校基本情報）'!$C$7","v":"（その他の法人の場合：　　　　　　　　　　　　　　　　　　　　）"}]
[null,null,null,null,null,null,null,null,null,null,null,null,null,null,null,null,null,null,null,null,"学校名",{"$f":"'様式３－２－１（学校基本情報）'!$C$8","v":0}]
[null,null,null,null,null,null,null,null,null,null,null,null,null,null,null,null,null,null,null,null,"学校コード",{"$f":"'様式３－２－１（学校基本情報）'!$C$9","v":""}]
[null,null,null,null,null,null,null,null,null,null,null,null,null,null,null,null,null,null,null,null,"法人番号 4)",{"$f":"'様式３－２－１（学校基本情報）'!$C$10","v":0}]
[null,null,null,null,null,null,null,null,null,null,null,null,null,null,null,null,null,null,null,null,"担当者名 5)",{"$f":"'様式３－２－１（学校基本情報）'!$C$11","v":0}]
[null,null,null,null,null,null,null,null,null,null,null,null,null,null,null,null,null,null,null,null,"担当者の直通電話",{"$f":"'様式３－２－１（学校基本情報）'!$C$12","v":0}]
[null,null,null,null,null,null,null,null,null,null,null,null,null,null,null,null,null,null,null,null,"担当者のemail",{"$f":"'様式３－２－１（学校基本情報）'!$C$13","v":0}]

{"sheet":"【別添】様式３－２－５","index":5,"n_rows":23,"n_cols":5,"rows_kept":23,"cut":false,"hidden":false,"merged":[[11,1,11,2],[15,3,16,3]]}
["各種障害の定義について判断に迷う場合"]
[null,"【視覚障害】","盲……視覚による教育が不可能又は著しく困難で、主として触覚及び聴覚など、視覚以外の感覚を利用しての教育が必要な程度\n弱視……視覚による教育は可能だが、文字の拡大など教育上特別の配慮が必要な程度（視野障害や、明るいところがまぶしく感じる羞明や暗いところが見えにくい夜盲等の明暗順応の障害を含む）\n※色覚異常、片目の失明については、「その他の障害」に計上し、診断名欄にその旨（色覚異常、片目の失明）を記入する。"]
[null,"【聴覚・言語障害】","聾……両耳の聴力損失60デシベル以上、又は補聴器等の使用によっても通常の話声を解することが不可能、又は著しく困難な程度\n難聴……両耳の聴力損失60デシベル未満、又は補聴器を使用すれば通常の話声を解することが可能な程度\n言語障害のみ……発声、発語に関する機能障害（構音障害、音声障害、流暢性の障害、言語発達遅滞、口蓋裂）"]
[null,"【肢体不自由】","上肢機能障害……腕、手、指および各関節に関する機能障害\n下肢機能障害……脚、足指および各関節に関する機能障害\n上下肢機能障害……上肢、下肢の両方に関する機能障害\n他の機能障害……体幹（胴体）に関する機能障害、体幹と上肢の機能障害、体幹と下肢の機能障害、体幹と上下肢の機能障害および運動の障害"]
[null,"【病弱・虚弱】","内部障害等……心臓機能障害、じん臓機能障害、呼吸器機能障害、ぼうこう又は直腸の機能障害、小腸機能障害、ヒト免疫不全ウイルスによる免疫機能障害、肝臓機能障害及び神経疾患、悪性新生物その他の疾患の状態が継続して医療又は生活規制を必要とする程度のもので、医師の診断書がある者\n他の慢性疾患……身体虚弱の状態が継続して生活規制を必要とする程度のもので、医師の診断書がある者 又は、健康診断等において上記の障害があることが明らかになった者\n※てんかん、アトピー性皮膚炎、食物アレルギー、アナフィラキシー等はここに計上する。\n※上記は、「学校教育法施行令障害の程度」及び「身体障害者障害程度等級表」または「小児慢性特定疾患」に該当する者を指す。これに当てはまらない疾患等は、「その他の障害」に計上。"]
[null,"【発達障害】\n（診断書有）","発達障害に関する医師の診断書がある者\nＳＬＤ……限局性学習症／限局性学習障害（旧ＬＤ：学習障害）\nＡＤＨＤ……注意欠如・多動症／注意欠如・多動性障害（旧注意欠陥／多動性障害）\nＡＳＤ……自閉スペクトラム症／自閉症スペクトラム障害（旧高機能自閉症等：高機能自　閉症及びアスペルガー症候群）\n発達障害の重複……上記の３つのいずれかが重複している者"]
[null,"【精神障害】","統合失調症等……統合失調症、統合失調型障害及び妄想性障害（ICD-10 F20-F29に該当する疾患）\n気分障害……躁病エピソード、双極性感情障害、うつ病エピソード、反復性うつ病性\n障害、持続性気分（感情）障害等（ICD-10 F30-F39に該当する疾患）\n神経症性障害等……不安障害、強迫性障害（強迫神経症）、重度ストレスへの反応及び適応障害、解離性（転換性）障害、身体表現性障害、神経衰弱等（ICD-10 F40-F48に該当する疾患）\n摂食障害、睡眠障害等……摂食障害、睡眠障害、依存を生じない物質の乱用等（ICD-10 F50-F59に該当する疾患）\n※ナルコレプシー、睡眠時無呼吸症候群はここに計上する。\n他の精神障害……上記に当てはまらない精神障害。高次脳機能障害、依存症候群、人格障害、トゥレット症候群、性別違和（性同一性障害）、緘黙症、知的障害、診断名が確定していない抑うつ状態等。"]
[null,"【その他の障害】","視覚障害、聴覚・言語障害、肢体不自由、病弱・虚弱、重複、発達障害及び精神障害に該当しない障害があり、医師の診断書がある者 又は、健康診断等において上記の障害があることが明らかになった者\n※多汗症、原因の特定できない過敏性腸症候群、頻尿等はここに計上する。"]
[null,"　※ ICDは世界保健機関による疾病及び関連保健問題の国際統計分類で、国際的に広く用いられている統計分類基準です。2022年5月時点の最新版はICD-11で、今後日本でも導入されます。"]
[]
["発達障害が疑われる生徒について学校が行っている「何らかの支援」の例"]
[null,"○授業支援○\n配慮依頼文書の配付、出席に関する配慮、学習指導、授業内容の代替・提出期限延長等、履修支援、学外実習・フィールドワーク配慮\n\n○授業以外の支援○\n（学生生活支援）居場所の確保、通学支援、個別支援情報の収集、情報取得支援 \n（社会的スキル指導）自己管理指導、対人関係支援、日常生活支援 \n（保健管理・生活支援）専門家によるカウンセリング、医療機関との連携、医療機器、薬剤の保管等、休憩室・治療室の確保、生活介助、介助者の入構、入室許可\n（進路・就職指導）キャリア教育、障害学生向け求人情報の提供、就職支援情報の提供、支援機関の紹介、インターンシップ先の開拓、就職先の開拓、就職活動支援　　など"]
[]
[null,null,null,"都道府県名 1)",{"$f":"'様式３－２－１（学校基本情報）'!$C$4","v":"03岩   手"}]
[null,null,null,"設置者名",{"$f":"'様式３－２－１（学校基本情報）'!$C$5","v":0}]
[null,null,null,"設置者の種別 2)",{"$f":"'様式３－２－１（学校基本情報）'!$C$6","v":0}]
[null,null,null,null,{"$f":"'様式３－２－１（学校基本情報）'!$C$7","v":"（その他の法人の場合：　　　　　　　　　　　　　　　　　　　　）"}]
[null,null,null,"学校名",{"$f":"'様式３－２－１（学校基本情報）'!$C$8","v":0}]
[null,null,null,"学校コード",{"$f":"'様式３－２－１（学校基本情報）'!$C$9","v":""}]
[null,null,null,"法人番号 4)",{"$f":"'様式３－２－１（学校基本情報）'!$C$10","v":0}]
[null,null,null,"担当者名 5)",{"$f":"'様式３－２－１（学校基本情報）'!$C$11","v":0}]
[null,null,null,"担当者の直通電話",{"$f":"'様式３－２－１（学校基本情報）'!$C$12","v":0}]
[null,null,null,"担当者のemail",{"$f":"'様式３－２－１（学校基本情報）'!$C$13","v":0}]

{"sheet":"様式３－２－６","index":6,"n_rows":55,"n_cols":18,"rows_kept":55,"cut":false,"hidden":false,"merged":[[3,16,3,17],[4,12,5,12],[4,13,5,13],[4,15,5,15],[4,16,5,16],[4,17,5,17],[23,9,24,9],[26,5,26,6],[27,5,27,6],[26,7,26,8],[27,7,27,8],[25,5,25,6],[25,7,25,8],[9,7,9,8],[3,7,3,8],[15,12,15,13],[15,14,15,15],[14,11,14,15],[3,11,3,12],[8,11,8,12],[9,11,9,12],[4,11,5,11],[3,13,3,15],[4,7,5,7],[4,8,5,8],[3,0,6,1],[23,3,24,3],[4,2,5,2],[4,3,5,3],[4,6,5,6],[10,0,16,1],[15,3,15,4],[15,5,15,6],[14,2,14,6],[3,2,3,3],[4,4,5,4],[3,4,3,6],[22,5,22,8],[23,5,24,6],[23,7,24,8],[8,7,8,8],[31,1,31,9],[37,1,37,9],[36,1,36,9],[33,2,33,9],[42,1,42,9],[41,1,41,9],[32,1,32,9],[34,2,34,9],[35,2,35,9],[47,11,48,11],[43,1,43,9],[39,1,39,9],[40,1,40,9],[38,1,38,9],[45,7,47,8]]}
["様式３－２－６",null,null,null,null,null,null,null,null,"【専修学校シート】"]
["（専修学校の学校評価・情報公開等について）",null,null,null,null,null,null,null,null,null,null,"未記入チェック"]
[]
["専修学校 2)",null,"自己点検評価又は自己評価 3)①",null,"学校関係者評価 3)②",null,null,"第三者評価 3)③",null,null,null,"自己評価 3)①",null,"学校関係者評価 3)②",null,null,"第三者評価 3)③"]
[null,null,"実　施","結果公表","実　施",null,"結果公表","実　施","結果公表",null,null,"実　施","結果公表","実　施",null,"結果公表","実　施","結果公表"]
[null,null,null,null,null,"うち評価者として企業等が参画して実施",null,null,null,null,null,null,null,null,"うち評価者として企業等が参画して実施"]
[null,null,null,null,null,null,null,null,null,null,null,{"$f":"IF(C7=\"\",\"エラー\",\"OK\")","v":"エラー"},{"$f":"IF(C7=\"している\",IF(D7=\"\",\"エラー\",\"OK\"),IF(D7=\"している\",\"エラー\",\"OK\"))","v":"OK"},{"$f":"IF(E7=\"\",\"エラー\",\"OK\")","v":"エラー"},"-",{"$f":"IF(E7=\"している\",IF(G7=\"\",\"エラー\",\"OK\"),IF(G7=\"している\",\"エラー\",\"OK\"))","v":"OK"},{"$f":"IF(H7=\"\",\"エラー\",\"OK\")","v":"エラー"},{"$f":"IF(H7=\"している\",IF(I7=\"\",\"エラー\",\"OK\"),IF(I7=\"している\",\"エラー\",\"OK\"))","v":"OK"}]
[null,null,null,null,null,null,null,"↓「している」の場合 4)"]
[null,null,null,null,null,null,null,"実施機関名（自由記述）",null,null,null,"実施機関名（自由記述）"]
[null,null,null,null,null,null,null,null,null,null,null,{"$f":"IF(H7=\"している\",IF(H10=\"\",\"エラー\",\"OK\"),\"OK\")","v":"OK"}]
["専修学校 2)",null,"情報公開 5)",null,null,null,null,null,null,null,null,"情報公開 5)"]
[null,null,"実　施",null,null,null,null,null,null,null,null,"実施"]
[null,null,null,null,null,null,null,null,null,null,null,{"$f":"IF(C13=\"\",\"エラー\",\"OK\")","v":"エラー"}]
[null,null,"↓「している」の場合 6)"]
[null,null,"財務情報等 7) の公開",null,null,null,null,null,null,null,null,"財務情報等7)の公開"]
[null,null,"一般公開 8) を行っているか","以下の方法で公開しているか（複数選択可）",null,"以下の情報の公開を行っているか（複数選択可）",null,null,null,null,null,"一般公開 8) を行っているか。","以下の方法で公開しているか（複数選択可）。",null,"以下の情報の公開を行っているか（複数選択可）。"]
[null,null,null,"設置者、学校のホームページに掲載",null,"財産目録",null,null,null,null,null,{"$f":"IF($C$13=\"している\",IF(C17=\"\",\"エラー\",\"OK\"),IF(C17=\"している\",\"エラー\",\"OK\"))","v":"OK"},"設置者若しくは学校のホームページに掲載",{"$f":"IF($C$13=\"している\",IF(E17=\"\",\"エラー\",\"OK\"),IF(E17=\"している\",\"エラー\",\"OK\"))","v":"OK"},"財産目録",{"$f":"IF($C$13=\"している\",IF(G17=\"\",\"エラー\",\"OK\"),IF(G17=\"している\",\"エラー\",\"OK\"))","v":"OK"}]
[null,null,null,"広報誌等の刊行物に掲載",null,"貸借対照表",null,null,null,null,null,null,"広報誌等の刊行物に掲載",{"$f":"IF($C$13=\"している\",IF(E18=\"\",\"エラー\",\"OK\"),IF(E18=\"している\",\"エラー\",\"OK\"))","v":"OK"},"貸借対照表",{"$f":"IF($C$13=\"している\",IF(G18=\"\",\"エラー\",\"OK\"),IF(G18=\"している\",\"エラー\",\"OK\"))","v":"OK"}]
[null,null,null,"学内掲示板等の掲示",null,"収支計算書",null,null,null,null,null,null,"学内掲示板等の掲示",{"$f":"IF($C$13=\"している\",IF(E19=\"\",\"エラー\",\"OK\"),IF(E19=\"している\",\"エラー\",\"OK\"))","v":"OK"},"収支計算書",{"$f":"IF($C$13=\"している\",IF(G19=\"\",\"エラー\",\"OK\"),IF(G19=\"している\",\"エラー\",\"OK\"))","v":"OK"}]
[null,null,null,"その他",null,"事業報告書",null,null,null,null,null,null,"その他",{"$f":"IF($C$13=\"している\",IF(E20=\"\",\"エラー\",\"OK\"),IF(E20=\"している\",\"エラー\",\"OK\"))","v":"OK"},"事業報告書",{"$f":"IF($C$13=\"している\",IF(G20=\"\",\"エラー\",\"OK\"),IF(G20=\"している\",\"エラー\",\"OK\"))","v":"OK"}]
[null,null,null,null,null,"監査報告書",null,null,null,null,null,null,null,null,"監査報告書",{"$f":"IF($C$13=\"している\",IF(G21=\"\",\"エラー\",\"OK\"),IF(G21=\"している\",\"エラー\",\"OK\"))","v":"OK"}]
[]
[null,null,"教員研修の実施",null,"職員研修の実施","会計基準"]
["　専修学校",null,null,"うち企業等と連携した教員研修を実施 9)",null,"私立学校振興助成法第4条第1項又は同法第9条に規定する補助金10) の交付を受ける学校法人であるか",null,"学校法人会計基準（昭和46年文部省令第18号）に準拠した会計処理を実施しているか 11)"]
[]
[null,"高等課程"]
[null,"専門課程"]
[null,"一般課程"]
[]
["〔注〕"]
["1)","黄色に着色されたセルについて「している」又は「していない」等選択肢から該当するものを選択してください。"]
["2)","「自己点検評価又は自己評価」、「学校関係者評価」、「第三者評価」、「情報公開」の項目は、今年度中に実施または結果公表をした場合には「している」を選択してください。例えば、今年度中に昨年度を対象とした評価又は情報公開を実施した場合は「している」を記入してください（なお、昨年度を対象とした評価又は情報公開を今年度の5月1日までに実施した場合、また、その結果を公表した場合を含みます）。"]
["3)","「自己点検評価又は自己評価」「学校関係者評価」「第三者評価」の欄には、以下に示す各評価について、実施及び結果公表をしているかどうか記入してください。\n結果公表については、学校のホームページにおける公表に限らず、学校において閲覧に供する等でも構いません。例えば、学校便りに掲載する、PTA総会等の機会に保護者に対する説明を実施する、地域住民等が閲覧可能な場所に掲示する等も含みます。\nなお、自己点検評価又は自己評価の実施及び結果公表は法令上の義務であり、第三者評価の実施及び結果公表は法令上の努力義務です。"]
[null,"①","「自己点検評価」とは、「専修学校における学校評価ガイドライン（令和８年３月文部科学省決定）」における「自己点検評価」を指す。\n「自己評価」とは、「専修学校における学校評価ガイドライン（令和８年３月文部科学省決定）」における「自己評価」を指す。"]
[null,"②","「学校関係者評価」とは、「専修学校における学校評価ガイドライン（令和８年３月文部科学省決定）」における「学校関係者評価」を指す。"]
[null,"③","「第三者評価」とは、「専修学校における学校評価ガイドライン（令和８年３月文部科学省決定）」における「第三者評価」を指す。"]
["4)","「第三者評価」について「している」を選択した場合には、具体的な実施機関名を記載してください（自由記述）。"]
["5)","「情報公開」とは、学校教育法第43条（第133条及び第134条において、専修学校及び各種学校に準用。）に基づき教育活動その他の学校運営の状況に関する情報の提供を行うものであることをいいます。なお、学校のホームページにおける情報公開に限らず、学校において閲覧に供する等でも構いません。例えば、学校便りに掲載する、PTA総会等の機会に保護者に対する説明を実施する、地域住民等が閲覧可能な場所に掲示する等も含みます。"]
["6)","「情報公開」について「している」を選択した場合には、そのうち、財務情報等の公開に関する情報についても回答してください。"]
["7)","「財務情報等」とは、一昨年度終了後2月以内に作成した財産目録、貸借対照表、収支計算書、事業報告書（それぞれの概要を含む）及び監査報告書をいいます。なお、設置者が学校法人等であって、財務情報等の取扱いについて法人本部等で対応している場合には、法人本部等の担当部署に確認して回答してください。"]
["8)","「一般公開｣とは、「利害関係人への閲覧」以外で、広く一般（受験生等を含む。）に対し、学校法人等のホームページへの掲載、広報誌等の刊行物（パンフレット類を含む。）への掲載等の方法により、財務情報等を公開することをいう。"]
["9)","企業等と連携した教員研修を実施している場合は「している」を選択してください。具体的には、①学内研修への企業等からの講師派遣、②学内研修への企業等からの助言、③実務経験習得のための企業等での教員の受け入れ、③企業等との情報交換会の開催、④企業等との共同研究による研修、⑤企業主催の研修への教員の参加、⑥業界団体・経済団体主催の研修への教員の参加、その他これらに類する企業等と連携した教員研修の実施が含まれます。"]
["10)","「私立学校振興助成法第4条第1項…に規定する補助金」とは、私立大学及び私立高等専門学校の経常的経費についての補助をいい、「同法第9条に規定する補助金」とは、学校法人に対する都道府県の補助に対する国の補助をいいます（都道府県が、区域内にある幼稚園、小学校、中学校、高等学校、中等教育学校、特別支援学校又は幼保連携型認定こども園を設置する学校法人に対し、当該学校における教育に係る経常的経費について補助する場合には、国は、都道府県に対し、政令で定めるところにより、その一部を補助することができるとされています）。"]
["11)","昨年度の会計処理についての質問です。また、「私立学校振興助成法第4条第1項又は同法第9条に規定する補助金の交付を受ける学校法人」でなければ、学校法人会計基準に準拠する法令上の義務はありません（私立学校振興助成法第14条第1項）が、任意で学校法人会計基準に準拠している場合には、「している」を選択してください。"]
[]
[null,null,null,null,null,null,null,{"$f":"IF(COUNTIF(U:AF,\"エラー\")=0,\"OK\",\"エラー\")","v":"OK"},null,null,null,"都道府県名 1)",{"$f":"'様式３－２－１（学校基本情報）'!$C$4","v":"03岩   手"}]
[null,null,null,null,null,null,null,null,null,null,null,"設置者名",{"$f":"'様式３－２－１（学校基本情報）'!$C$5","v":0}]
[null,null,null,null,null,null,null,null,null,null,null,"設置者の種別 2)",{"$f":"'様式３－２－１（学校基本情報）'!$C$6","v":0}]
[null,null,null,null,null,null,null,null,null,null,null,null,{"$f":"'様式３－２－１（学校基本情報）'!$C$7","v":"（その他の法人の場合：　　　　　　　　　　　　　　　　　　　　）"}]
[null,null,null,null,null,null,null,null,null,null,null,"学校名",{"$f":"'様式３－２－１（学校基本情報）'!$C$8","v":0}]
[null,null,null,null,null,null,null,null,null,null,null,"学校コード",{"$f":"'様式３－２－１（学校基本情報）'!$C$9","v":""}]
[null,null,null,null,null,null,null,null,null,null,null,"法人番号 4)",{"$f":"'様式３－２－１（学校基本情報）'!$C$10","v":0}]
[null,null,null,null,null,null,null,null,null,null,null,"担当者名 5)",{"$f":"'様式３－２－１（学校基本情報）'!$C$11","v":0}]
[null,null,null,null,null,null,null,null,null,null,null,"担当者の直通電話",{"$f":"'様式３－２－１（学校基本情報）'!$C$12","v":0}]
[null,null,null,null,null,null,null,null,null,null,null,"担当者のemail",{"$f":"'様式３－２－１（学校基本情報）'!$C$13","v":0}]

{"sheet":"様式３－２－７－１","index":7,"n_rows":222,"n_cols":23,"rows_kept":222,"cut":false,"hidden":false,"merged":[[217,12,219,13],[221,12,221,16],[208,10,208,11],[208,12,208,13],[211,1,211,2],[212,1,212,2],[213,1,213,2],[214,1,214,2],[206,1,210,2],[206,3,210,3],[206,4,209,4],[206,5,209,5],[206,6,206,14],[206,15,209,15],[207,6,209,6],[207,7,207,13],[207,14,209,14],[208,8,208,9],[200,1,200,2],[201,1,201,2],[202,1,202,2],[203,1,203,2],[205,1,205,2],[205,13,205,15],[196,6,198,6],[196,7,196,13],[196,14,198,14],[197,8,197,9],[197,10,197,11],[197,12,197,13],[192,1,192,8],[192,10,192,11],[193,1,193,2],[194,13,194,15],[195,1,199,2],[195,3,199,3],[195,4,198,4],[195,5,198,5],[195,6,195,14],[195,15,198,15],[187,1,187,2],[187,11,189,11],[188,1,188,2],[189,1,189,2],[190,1,190,2],[190,10,190,11],[183,6,185,6],[183,7,183,9],[183,10,185,10],[184,7,185,7],[184,8,185,8],[184,9,185,9],[179,1,179,2],[179,10,179,11],[181,1,181,9],[181,10,181,11],[182,1,186,2],[182,3,186,3],[182,4,185,4],[182,5,185,5],[182,7,182,10],[182,11,186,11],[176,1,176,2],[176,11,178,11],[177,1,177,2],[178,1,178,2],[171,1,175,2],[171,3,175,3],[171,4,174,4],[171,5,174,5],[171,7,171,10],[171,11,175,11],[172,6,174,6],[172,7,172,9],[172,10,174,10],[173,7,174,7],[173,8,174,8],[173,9,174,9],[165,1,165,2],[166,1,166,2],[167,1,167,2],[168,1,168,2],[170,1,170,9],[170,10,170,11],[160,6,160,14],[160,15,163,15],[161,6,163,6],[161,7,161,13],[161,14,163,14],[162,8,162,9],[162,10,162,11],[162,12,162,13],[151,12,151,13],[159,1,159,2],[160,1,164,2],[160,3,164,3],[160,4,163,4],[160,5,163,5],[154,1,154,2],[155,1,155,2],[156,1,156,2],[157,1,157,2],[142,1,142,2],[142,17,144,17],[143,1,143,2],[144,1,144,2],[145,1,145,2],[146,1,146,13],[149,4,152,4],[149,5,152,5],[138,18,141,18],[137,1,141,2],[137,3,141,3],[137,4,140,4],[137,5,140,5],[137,6,137,14],[137,17,137,22],[149,1,153,2],[149,3,153,3],[149,6,149,14],[149,15,152,15],[150,6,152,6],[150,7,150,13],[150,14,152,14],[151,8,151,9],[151,10,151,11],[138,19,141,19],[138,20,141,20],[138,21,141,21],[138,6,140,6],[138,7,138,13],[138,14,140,14],[138,17,141,17],[138,22,141,22],[139,8,139,9],[139,10,139,11],[139,12,139,13],[129,1,129,2],[129,17,131,17],[130,1,130,2],[131,1,131,2],[132,1,132,2],[133,1,133,12],[124,17,124,21],[125,6,127,6],[125,7,125,13],[125,14,127,14],[125,17,128,17],[125,18,128,18],[125,19,128,19],[125,20,128,20],[125,21,128,21],[126,8,126,9],[121,9,121,10],[121,11,121,12],[123,13,123,14],[124,1,128,2],[124,3,128,3],[124,4,127,4],[124,5,127,5],[124,6,124,14],[126,10,126,11],[126,12,126,13],[117,7,117,14],[118,9,118,10],[118,11,118,12],[119,9,119,10],[119,11,119,12],[120,9,120,10],[120,11,120,12],[110,1,110,2],[110,17,112,17],[111,1,111,2],[112,1,112,2],[113,1,113,2],[116,7,116,14],[105,17,105,21],[106,6,108,6],[106,7,106,13],[106,14,108,14],[106,17,109,17],[106,18,109,18],[106,19,109,19],[106,20,109,20],[106,21,109,21],[107,8,107,9],[102,9,102,10],[102,11,102,12],[105,1,109,2],[105,3,109,3],[105,4,108,4],[105,5,108,5],[105,6,105,14],[107,10,107,11],[107,12,107,13],[98,7,98,14],[99,9,99,10],[99,11,99,12],[100,9,100,10],[100,11,100,12],[101,9,101,10],[101,11,101,12],[91,1,91,2],[91,17,93,17],[92,1,92,2],[93,1,93,2],[94,1,94,2],[97,7,97,14],[85,13,85,14],[86,1,90,2],[86,3,90,3],[86,4,89,4],[86,5,89,5],[86,6,86,14],[88,12,88,13],[78,1,78,2],[78,17,80,17],[79,1,79,2],[80,1,80,2],[81,1,81,2],[82,1,82,13],[86,17,86,20],[87,6,89,6],[87,7,87,13],[87,14,89,14],[87,17,90,17],[87,18,90,18],[87,19,90,19],[87,20,90,20],[88,8,88,9],[88,10,88,11],[73,17,73,22],[74,6,76,6],[74,7,74,13],[74,14,76,14],[74,17,77,17],[74,18,77,18],[74,19,77,19],[74,20,77,20],[74,21,77,21],[74,22,77,22],[72,13,72,14],[73,1,77,2],[73,3,77,3],[73,4,76,4],[73,5,76,5],[73,6,73,14],[75,8,75,9],[75,10,75,11],[75,12,75,13],[65,1,65,2],[65,17,67,17],[66,1,66,2],[67,1,67,2],[68,1,68,2],[69,1,69,13],[60,17,60,21],[61,6,63,6],[61,7,61,13],[61,14,63,14],[61,17,64,17],[61,18,64,18],[61,19,64,19],[61,20,64,20],[61,21,64,21],[62,8,62,9],[57,9,57,10],[57,11,57,12],[59,13,59,14],[60,1,64,2],[60,3,64,3],[60,4,63,4],[60,5,63,5],[60,6,60,14],[62,10,62,11],[62,12,62,13],[53,7,53,14],[54,9,54,10],[54,11,54,12],[55,9,55,10],[55,11,55,12],[56,9,56,10],[56,11,56,12],[46,1,46,2],[46,17,48,17],[47,1,47,2],[48,1,48,2],[49,1,49,2],[52,7,52,14],[41,17,41,21],[42,6,44,6],[42,7,42,13],[42,14,44,14],[42,17,45,17],[42,18,45,18],[42,19,45,19],[42,20,45,20],[42,21,45,21],[43,8,43,9],[37,9,37,10],[37,11,37,12],[41,1,45,2],[41,3,45,3],[41,4,44,4],[41,5,44,5],[41,6,41,14],[43,10,43,11],[43,12,43,13],[33,7,33,14],[34,9,34,10],[34,11,34,12],[35,9,35,10],[35,11,35,12],[36,9,36,10],[36,11,36,12],[26,1,26,2],[26,17,28,17],[27,1,27,2],[28,1,28,2],[29,1,29,2],[32,7,32,14],[22,18,25,18],[22,19,25,19],[22,20,25,20],[23,8,23,9],[23,10,23,11],[23,12,23,13],[21,1,25,2],[21,3,25,3],[21,4,24,4],[21,5,24,5],[21,6,21,14],[21,17,21,20],[22,6,24,6],[22,7,22,13],[22,14,24,14],[22,17,25,17],[8,17,8,18],[9,17,9,18],[10,17,10,18],[11,17,11,18],[12,17,12,18],[20,13,20,14],[2,1,2,7],[3,17,3,18],[4,17,4,18],[5,17,5,18],[6,17,6,18],[7,17,7,18]]}
[null,"様式３－２－７－１"]
[null,"校舎施設の状況（設置者所有）"]
[null,"専修学校の耐震化状況（令和8年5月1日時点）"]
[null,null,null,null,null,null,null,null,null,null,null,null,null,null,null,null,null,"都道府県名 1)",null,{"$f":"'様式３－２－１（学校基本情報）'!C4","v":"03岩   手"}]
[null,null,null,null,null,null,null,null,null,null,null,null,null,null,null,null,null,"設置者名",null,{"$f":"'様式３－２－１（学校基本情報）'!C5","v":0}]
[null,null,null,null,null,null,null,null,null,null,null,null,null,null,null,null,null,"設置者の種別 2)",null,{"$f":"'様式３－２－１（学校基本情報）'!C6","v":0}]
[null,null,null,null,null,null,null,null,null,null,null,null,null,null,null,null,null,"（その他の法人の場合：　　　　　　　　　　　　　　　　　　　　　　　　　　　　　　　　　　）",null,{"$f":"'様式３－２－１（学校基本情報）'!C7","v":"（その他の法人の場合：　　　　　　　　　　　　　　　　　　　　）"}]
[null,null,null,null,null,null,null,null,null,null,null,null,null,null,null,null,null,"学校名",null,{"$f":"'様式３－２－１（学校基本情報）'!C8","v":0}]
[null,null,null,null,null,null,null,null,null,null,null,null,null,null,null,null,null,"学校コード",null,{"$f":"'様式３－２－１（学校基本情報）'!$C$9","v":""}]
[null,null,null,null,null,null,null,null,null,null,null,null,null,null,null,null,null,"法人番号 4)",null,{"$f":"'様式３－２－１（学校基本情報）'!C10","v":0}]
[null,null,null,null,null,null,null,null,null,null,null,null,null,null,null,null,null,"担当者名 5)",null,{"$f":"'様式３－２－１（学校基本情報）'!C11","v":0}]
[null,null,null,null,null,null,null,null,null,null,null,null,null,null,null,null,null,"担当者の直通電話",null,{"$f":"'様式３－２－１（学校基本情報）'!C12","v":0}]
[null,null,null,null,null,null,null,null,null,null,null,null,null,null,null,null,null,"担当者のemail",null,{"$f":"'様式３－２－１（学校基本情報）'!C13","v":0}]
[]
[]
[]
[]
[]
[null,"【避難所指定を受けている学校】"]
[]
[null,"【A表】棟数で入力",null,null,null,null,null,null,null,null,null,null,null,"(単位：棟）"]
[null,"「担当者名」の欄は、事務担当者を記載してください。",null,"生徒数が一番多い課程","全棟数","昭和57年以降の建築棟数\n（A-C）","昭和56年以前建築の棟数",null,null,null,null,null,null,null,null,null,null,"確認用チェック欄"]
[null,null,null,null,null,null,"昭和56年以前建築の棟数","耐震診断実施の棟数",null,null,null,null,null,null,"耐震診断未実施の棟数\n（C-D）",null,null,"「生徒数が一番多い課程」は「○」が一つ選択されているか","「全棟数」は記入されているか","「昭和57年以降の建築棟数」がマイナスになっていないか","「耐震診断未実施の棟数」がマイナスになっていないか"]
[null,null,null,null,null,null,null,null,"耐震化済の棟数（Ｉｓ値0.6以上）",null,"改修予定有の棟数（Ｉｓ値0.6未満）",null,"改修予定無の棟数（Ｉｓ値0.6未満）"]
[null,null,null,null,null,null,null,"（E～Jの計）","改修の必要がない棟数","改修済の棟数","0.3未満","0.3以上0.6未満","0.3未満","0.3以上0.6未満"]
[null,null,null,null,"A","B","C","D","E","F","G","H","I","J","K"]
[null,"専門課程",null,null,null,{"$f":"E27-G27","v":0},null,{"$f":"SUM(I27:N27)","v":0},null,null,null,null,null,null,{"$f":"G27-H27","v":0},null,null,{"$f":"IF(COUNTA(E27:E29,G27:G29,I27:N29)=0,\"OK\",IF(COUNTIF(D27:D29,\"○\")=1,\"OK\",\"エラー\"))","v":"OK"},{"$f":"IF(COUNTA(G27,I27:N27)>=1,IF(E27<=0,\"エラー\",\"OK\"),\"OK\")","v":"OK"},{"$f":"IF(F27<0,\"エラー\",\"OK\")","v":"OK"},{"$f":"IF(O27<0,\"エラー\",\"OK\")","v":"OK"}]
[null,"高等課程",null,null,null,{"$f":"E28-G28","v":0},null,{"$f":"SUM(I28:N28)","v":0},null,null,null,null,null,null,{"$f":"G28-H28","v":0},null,null,null,{"$f":"IF(COUNTA(G28,I28:N28)>=1,IF(E28<=0,\"エラー\",\"OK\"),\"OK\")","v":"OK"},{"$f":"IF(F28<0,\"エラー\",\"OK\")","v":"OK"},{"$f":"IF(O28<0,\"エラー\",\"OK\")","v":"OK"}]
[null,"一般課程",null,null,null,{"$f":"E29-G29","v":0},null,{"$f":"SUM(I29:N29)","v":0},null,null,null,null,null,null,{"$f":"G29-H29","v":0},null,null,null,{"$f":"IF(COUNTA(G29,I29:N29)>=1,IF(E29<=0,\"エラー\",\"OK\"),\"OK\")","v":"OK"},{"$f":"IF(F29<0,\"エラー\",\"OK\")","v":"OK"},{"$f":"IF(O29<0,\"エラー\",\"OK\")","v":"OK"}]
[null,"小　計",null,null,{"$f":"SUM(E27:E29)","v":0},{"$f":"SUM(F27:F29)","v":0},0,0,0,0,0,0,0,0,0]
[]
[]
[null,null,null,null,null,null,null,"「改修予定有」の棟に関して、改修予定時期について入力"]
[null,null,null,null,null,null,null,"（２棟以上の棟がある場合は、そのうち直近の時期について入力）"]
[null,null,null,null,null,null,null,null,null,"【Is値0.3未満】",null,"【Is値0.3以上0.6未満】"]
[null,null,null,null,null,null,null,null,"専門課程"]
[null,null,null,null,null,null,null,null,"高等課程"]
[null,null,null,null,null,null,null,null,"一般課程"]
[]
[]
[null,"【a表】上記表（A表）へ回答した建物のうち、2階建て以上又は延べ床面積が200㎡以上の建物（非木造のものに限る）の数を下記表へ入力すること。",null,null,null,null,null,null,null,null,null,null,null,null,"(単位：棟）"]
[null,null,null,"生徒数が一番多い課程","全棟数","昭和57年以降の建築棟数\n（A-C）","昭和56年以前建築の棟数",null,null,null,null,null,null,null,null,null,null,"確認用チェック欄"]
[null,null,null,null,null,null,"昭和56年以前建築の棟数","耐震診断実施の棟数",null,null,null,null,null,null,"耐震診断未実施の棟数\n（C-D）",null,null,"「生徒数が一番多い課程」は「○」が一つ選択されているか","「全棟数」は記入されているか","「昭和57年以降の建築棟数」がマイナスになっていないか","「耐震診断未実施の棟数」がマイナスになっていないか","上記表を上回る棟数を入力している箇所がないか"]
[null,null,null,null,null,null,null,null,"耐震化済の棟数（Ｉｓ値0.6以上）",null,"改修予定有の棟数（Ｉｓ値0.6未満）",null,"改修予定無の棟数（Ｉｓ値0.6未満）"]
[null,null,null,null,null,null,null,"（E～Jの計）","改修の必要がない棟数","改修済の棟数","0.3未満","0.3以上0.6未満","0.3未満","0.3以上0.6未満"]
[null,null,null,null,"A","B","C","D","E","F","G","H","I","J","K"]
[null,"専門課程",null,{"$f":"IF(D27=\"\",\"\",D27)","v":""},null,{"$f":"E47-G47","v":0},null,{"$f":"SUM(I47:N47)","v":0},null,null,null,null,null,null,{"$f":"G47-H47","v":0},null,null,{"$f":"IF(COUNTA(E47:E49,G47:G49,I47:N49)=0,\"OK\",IF(COUNTIF(D47:D49,\"○\")=1,\"OK\",\"エラー\"))","v":"OK"},{"$f":"IF(COUNTA(G47,I47:N47)>=1,IF(E47<=0,\"エラー\",\"OK\"),\"OK\")","v":"OK"},{"$f":"IF(F47<0,\"エラー\",\"OK\")","v":"OK"},{"$f":"IF(O47<0,\"エラー\",\"OK\")","v":"OK"},{"$f":"IF(AND(E47<=E27,G47<=G27,I47<=I27,J47<=J27,K47<=K27,L47<=L27,M47<=M27,N47<=N27),\"OK\",\"エラー\")","v":"OK"}]
[null,"高等課程",null,{"$f":"IF(D28=\"\",\"\",D28)","v":""},null,{"$f":"E48-G48","v":0},null,{"$f":"SUM(I48:N48)","v":0},null,null,null,null,null,null,{"$f":"G48-H48","v":0},null,null,null,{"$f":"IF(COUNTA(G48,I48:N48)>=1,IF(E48<=0,\"エラー\",\"OK\"),\"OK\")","v":"OK"},{"$f":"IF(F48<0,\"エラー\",\"OK\")","v":"OK"},{"$f":"IF(O48<0,\"エラー\",\"OK\")","v":"OK"},{"$f":"IF(AND(E48<=E28,G48<=G28,I48<=I28,J48<=J28,K48<=K28,L48<=L28,M48<=M28,N48<=N28),\"OK\",\"エラー\")","v":"OK"}]
[null,"一般課程",null,{"$f":"IF(D29=\"\",\"\",D29)","v":""},null,{"$f":"E49-G49","v":0},null,{"$f":"SUM(I49:N49)","v":0},null,null,null,null,null,null,{"$f":"G49-H49","v":0},null,null,null,{"$f":"IF(COUNTA(G49,I49:N49)>=1,IF(E49<=0,\"エラー\",\"OK\"),\"OK\")","v":"OK"},{"$f":"IF(F49<0,\"エラー\",\"OK\")","v":"OK"},{"$f":"IF(O49<0,\"エラー\",\"OK\")","v":"OK"},{"$f":"IF(AND(E49<=E29,G49<=G29,I49<=I29,J49<=J29,K49<=K29,L49<=L29,M49<=M29,N49<=N29),\"OK\",\"エラー\")","v":"OK"}]
[null,"小　計",null,null,{"$f":"SUM(E47:E49)","v":0},{"$f":"SUM(F47:F49)","v":0},{"$f":"SUM(G47:G49)","v":0},0,0,0,0,0,0,0,0]
[]
[]
[null,null,null,null,null,null,null,"「改修予定有」の棟に関して、改修予定時期について入力"]
[null,null,null,null,null,null,null,"（２棟以上の棟がある場合は、そのうち直近の時期について入力）"]
[null,null,null,null,null,null,null,null,null,"【Is値0.3未満】",null,"【Is値0.3以上0.6未満】"]
[null,null,null,null,null,null,null,null,"専門課程"]
[null,null,null,null,null,null,null,null,"高等課程"]
[null,null,null,null,null,null,null,null,"一般課程"]
[]
[null,"【B表】面積で入力（A表に回答した建物の面積について記載すること）",null,null,null,null,null,null,null,null,null,null,null,"(単位：㎡）"]
[null,null,null,"生徒数が一番多い課程","全保有面積","昭和57年以降建築の面積\n（A-C）","昭和56年以前建築の面積",null,null,null,null,null,null,null,null,null,null,"確認用チェック欄"]
[null,null,null,null,null,null,"昭和56年以前建築の面積","耐震診断実施の面積",null,null,null,null,null,null,"耐震診断未実施の面積\n（C-D）",null,null,"「生徒数が一番多い課程」は「○」が一つ選択されているか","「全保有面積」は記入されているか","「昭和57年以降建築の面積」がマイナスになっていないか","「耐震診断未実施の面積」がマイナスになっていないか","「棟数」を回答した欄に回答しているか"]
[null,null,null,null,null,null,null,null,"耐震化済の面積（Ｉｓ値0.6以上）",null,"改修予定有の面積（Ｉｓ値0.6未満）",null,"改修予定無の面積（Ｉｓ値0.6未満）"]
[null,null,null,null,null,null,null,"（E～Lの計）","改修の必要がない棟の面積","改修済の棟の面積","0.3未満","0.3以上0.6未満","0.3未満","0.3以上0.6未満"]
[null,null,null,null,"A","B","C","D","E","F","G","H","I","J","K"]
[null,"専門課程",null,{"$f":"IF(D27=\"\",\"\",D27)","v":""},null,{"$f":"E66- G66","v":0},null,{"$f":"SUM(I66:N66)","v":0},null,null,null,null,null,null,{"$f":"+G66-H66","v":0},null,null,{"$f":"IF(COUNTA(E66:E68,G66:G68,I66:N68)=0,\"OK\",IF(COUNTIF(D66:D68,\"○\")=1,\"OK\",\"エラー\"))","v":"OK"},{"$f":"IF(COUNTA(G66,I66:N66)>=1,IF(E66<=0,\"エラー\",\"OK\"),\"OK\")","v":"OK"},{"$f":"IF(F66<0,\"エラー\",\"OK\")","v":"OK"},{"$f":"IF(O66<0,\"エラー\",\"OK\")","v":"OK"},{"$f":"IF(AND(COUNTA(E27)=COUNTA(E66),COUNTA(G27)=COUNTA(G66),COUNTA(I27)=COUNTA(I66),COUNTA(J27)=COUNTA(J66),COUNTA(K27)=COUNTA(K66),COUNTA(L27)=COUNTA(L66),COUNTA(M27)=COUNTA(M66),COUNTA(N27)=COUNTA(N66)),\"OK\",\"エラー\")","v":"OK"}]
[null,"高等課程",null,{"$f":"IF(D28=\"\",\"\",D28)","v":""},null,{"$f":"E67- G67","v":0},null,{"$f":"SUM(I67:N67)","v":0},null,null,null,null,null,null,{"$f":"+G67-H67","v":0},null,null,null,{"$f":"IF(COUNTA(G67,I67:N67)>=1,IF(E67<=0,\"エラー\",\"OK\"),\"OK\")","v":"OK"},{"$f":"IF(F67<0,\"エラー\",\"OK\")","v":"OK"},{"$f":"IF(O67<0,\"エラー\",\"OK\")","v":"OK"},{"$f":"IF(AND(COUNTA(E28)=COUNTA(E67),COUNTA(G28)=COUNTA(G67),COUNTA(I28)=COUNTA(I67),COUNTA(J28)=COUNTA(J67),COUNTA(K28)=COUNTA(K67),COUNTA(L28)=COUNTA(L67),COUNTA(M28)=COUNTA(M67),COUNTA(N28)=COUNTA(N67)),\"OK\",\"エラー\")","v":"OK"}]
[null,"一般課程",null,{"$f":"IF(D29=\"\",\"\",D29)","v":""},null,{"$f":"E68- G68","v":0},null,{"$f":"SUM(I68:N68)","v":0},null,null,null,null,null,null,{"$f":"+G68-H68","v":0},null,null,null,{"$f":"IF(COUNTA(G68,I68:N68)>=1,IF(E68<=0,\"エラー\",\"OK\"),\"OK\")","v":"OK"},{"$f":"IF(F68<0,\"エラー\",\"OK\")","v":"OK"},{"$f":"IF(O68<0,\"エラー\",\"OK\")","v":"OK"},{"$f":"IF(AND(COUNTA(E29)=COUNTA(E68),COUNTA(G29)=COUNTA(G68),COUNTA(I29)=COUNTA(I68),COUNTA(J29)=COUNTA(J68),COUNTA(K29)=COUNTA(K68),COUNTA(L29)=COUNTA(L68),COUNTA(M29)=COUNTA(M68),COUNTA(N29)=COUNTA(N68)),\"OK\",\"エラー\")","v":"OK"}]
[null,"小　計",null,null,{"$f":"SUM(E66:E68)","v":0},0,0,0,0,0,0,0,0,0,0]
[null,"※　小数第３位の値は四捨五入され、小数第２位までの表示となる。"]
[]
[null,"【b表】上記表（B表）へ回答した建物のうち、2階建て以上又は延べ床面積が200㎡以上の建物（非木造のものに限る）の数を下記表へ入力すること。"]
[null,"（a表に回答した建物の面積について記載すること）",null,null,null,null,null,null,null,null,null,null,null,"(単位：㎡）"]
[null,null,null,"生徒数が一番多い課程","全保有面積","昭和57年以降建築の面積\n（A-C）","昭和56年以前建築の面積",null,null,null,null,null,null,null,null,null,null,"確認用チェック欄"]
[null,null,null,null,null,null,"昭和56年以前建築の面積","耐震診断実施の面積",null,null,null,null,null,null,"耐震診断未実施の面積\n（C-D）",null,null,"「生徒数が一番多い課程」は「○」が一つ選択されているか","「全保有面積」は記入されているか","「昭和57年以降建築の面積」がマイナスになっていないか","「耐震診断未実施の面積」がマイナスになっていないか","「棟数」を回答した欄に回答しているか","上記表を上回る棟数を入力している箇所がないか"]
[null,null,null,null,null,null,null,null,"耐震化済の面積（Ｉｓ値0.6以上）",null,"改修予定有の面積（Ｉｓ値0.6未満）",null,"改修予定無の面積（Ｉｓ値0.6未満）"]
[null,null,null,null,null,null,null,"（E～Lの計）","改修の必要がない棟の面積","改修済の棟の面積","0.3未満","0.3以上0.6未満","0.3未満","0.3以上0.6未満"]
[null,null,null,null,"A","B","C","D","E","F","G","H","I","J","K"]
[null,"専門課程",null,{"$f":"IF(D47=\"\",\"\",D47)","v":""},null,{"$f":"E79- G79","v":0},null,{"$f":"SUM(I79:N79)","v":0},null,null,null,null,null,null,{"$f":"+G79-H79","v":0},null,null,{"$f":"IF(COUNTA(E79:E81,G79:G81,I79:N81)=0,\"OK\",IF(COUNTIF(D79:D81,\"○\")=1,\"OK\",\"エラー\"))","v":"OK"},{"$f":"IF(COUNTA(G79,I79:N79)>=1,IF(E79<=0,\"エラー\",\"OK\"),\"OK\")","v":"OK"},{"$f":"IF(F79<0,\"エラー\",\"OK\")","v":"OK"},{"$f":"IF(O79<0,\"エラー\",\"OK\")","v":"OK"},{"$f":"IF(AND(COUNTA(E47)=COUNTA(E79),COUNTA(G47)=COUNTA(G79),COUNTA(I47)=COUNTA(I79),COUNTA(J47)=COUNTA(J79),COUNTA(K47)=COUNTA(K79),COUNTA(L47)=COUNTA(L79),COUNTA(M47)=COUNTA(M79),COUNTA(N47)=COUNTA(N79)),\"OK\",\"エラー\")","v":"OK"},{"$f":"IF(AND(E79<=E66,G79<=G66,I79<=I66,J79<=J66,K79<=K66,L79<=L66,M79<=M66,N79<=N66),\"OK\",\"エラー\")","v":"OK"}]
[null,"高等課程",null,{"$f":"IF(D48=\"\",\"\",D48)","v":""},null,{"$f":"E80- G80","v":0},null,{"$f":"SUM(I80:N80)","v":0},null,null,null,null,null,null,{"$f":"+G80-H80","v":0},null,null,null,{"$f":"IF(COUNTA(G80,I80:N80)>=1,IF(E80<=0,\"エラー\",\"OK\"),\"OK\")","v":"OK"},{"$f":"IF(F80<0,\"エラー\",\"OK\")","v":"OK"},{"$f":"IF(O80<0,\"エラー\",\"OK\")","v":"OK"},{"$f":"IF(AND(COUNTA(E48)=COUNTA(E80),COUNTA(G48)=COUNTA(G80),COUNTA(I48)=COUNTA(I80),COUNTA(J48)=COUNTA(J80),COUNTA(K48)=COUNTA(K80),COUNTA(L48)=COUNTA(L80),COUNTA(M48)=COUNTA(M80),COUNTA(N48)=COUNTA(N80)),\"OK\",\"エラー\")","v":"OK"},{"$f":"IF(AND(E80<=E67,G80<=G67,I80<=I67,J80<=J67,K80<=K67,L80<=L67,M80<=M67,N80<=N67),\"OK\",\"エラー\")","v":"OK"}]
[null,"一般課程",null,{"$f":"IF(D49=\"\",\"\",D49)","v":""},null,{"$f":"E81- G81","v":0},null,{"$f":"SUM(I81:N81)","v":0},null,null,null,null,null,null,{"$f":"+G81-H81","v":0},null,null,null,{"$f":"IF(COUNTA(G81,I81:N81)>=1,IF(E81<=0,\"エラー\",\"OK\"),\"OK\")","v":"OK"},{"$f":"IF(F81<0,\"エラー\",\"OK\")","v":"OK"},{"$f":"IF(O81<0,\"エラー\",\"OK\")","v":"OK"},{"$f":"IF(AND(COUNTA(E49)=COUNTA(E81),COUNTA(G49)=COUNTA(G81),COUNTA(I49)=COUNTA(I81),COUNTA(J49)=COUNTA(J81),COUNTA(K49)=COUNTA(K81),COUNTA(L49)=COUNTA(L81),COUNTA(M49)=COUNTA(M81),COUNTA(N49)=COUNTA(N81)),\"OK\",\"エラー\")","v":"OK"},{"$f":"IF(AND(E81<=E68,G81<=G68,I81<=I68,J81<=J68,K81<=K68,L81<=L68,M81<=M68,N81<=N68),\"OK\",\"エラー\")","v":"OK"}]
[null,"小　計",null,null,{"$f":"SUM(E79:E81)","v":0},0,0,0,0,0,0,0,0,0,0]
[null,"※　小数第３位の値は四捨五入され、小数第２位までの表示となる。"]
[]
[null,"【避難所指定を受けていない学校】"]
[null,"【C表】棟数で入力",null,null,null,null,null,null,null,null,null,null,null,"(単位：棟）"]
[null,null,null,"生徒数が一番多い課程","全棟数","昭和57年以降の建築棟数\n（A-C）","昭和56年以前建築の棟数",null,null,null,null,null,null,null,null,null,null,"確認用チェック欄"]
[null,null,null,null,null,null,"昭和56年以前建築の棟数","耐震診断実施の棟数",null,null,null,null,null,null,"耐震診断未実施の棟数\n（C-D）",null,null,"「生徒数が一番多い課程」は「○」が一つ選択されているか","「全棟数」は記入されているか","「昭和57年以降の建築棟数」がマイナスになっていないか","「耐震診断未実施の棟数」がマイナスになっていないか"]
[null,null,null,null,null,null,null,null,"耐震化済の棟数（Ｉｓ値0.6以上）",null,"改修予定有の棟数（Ｉｓ値0.6未満）",null,"改修予定無の棟数（Ｉｓ値0.6未満）"]
[null,null,null,null,null,null,null,"（E～Lの計）","改修の必要がない棟数","改修済の棟数","0.3未満","0.3以上0.6未満","0.3未満","0.3以上0.6未満"]
[null,null,null,null,"A","B","C","D","E","F","G","H","I","J","K"]
[null,"専門課程",null,null,null,{"$f":"E92-G92","v":0},null,{"$f":"SUM(I92:N92)","v":0},null,null,null,null,null,null,{"$f":"G92-H92","v":0},null,null,{"$f":"IF(COUNTA(E92:E94,G92:G94,I92:N94)=0,\"OK\",IF(COUNTIF(D92:D94,\"○\")=1,\"OK\",\"エラー\"))","v":"OK"},{"$f":"IF(COUNTA(G92,I92:N92)>=1,IF(E92<=0,\"エラー\",\"OK\"),\"OK\")","v":"OK"},{"$f":"IF(F92<0,\"エラー\",\"OK\")","v":"OK"},{"$f":"IF(O92<0,\"エラー\",\"OK\")","v":"OK"}]
[null,"高等課程",null,null,null,{"$f":"E93-G93","v":0},null,{"$f":"SUM(I93:N93)","v":0},null,null,null,null,null,null,{"$f":"G93-H93","v":0},null,null,null,{"$f":"IF(COUNTA(G93,I93:N93)>=1,IF(E93<=0,\"エラー\",\"OK\"),\"OK\")","v":"OK"},{"$f":"IF(F93<0,\"エラー\",\"OK\")","v":"OK"},{"$f":"IF(O93<0,\"エラー\",\"OK\")","v":"OK"}]
[null,"一般課程",null,null,null,{"$f":"E94-G94","v":0},null,{"$f":"SUM(I94:N94)","v":0},null,null,null,null,null,null,{"$f":"G94-H94","v":0},null,null,null,{"$f":"IF(COUNTA(G94,I94:N94)>=1,IF(E94<=0,\"エラー\",\"OK\"),\"OK\")","v":"OK"},{"$f":"IF(F94<0,\"エラー\",\"OK\")","v":"OK"},{"$f":"IF(O94<0,\"エラー\",\"OK\")","v":"OK"}]
[null,"小　計",null,null,{"$f":"SUM(E92:E94)","v":0},{"$f":"SUM(F92:F94)","v":0},{"$f":"SUM(G92:G94)","v":0},0,0,0,0,0,0,0,0]
[]
[]
[null,null,null,null,null,null,null,"「改修予定有」の棟に関して、改修予定時期について入力"]
[null,null,null,null,null,null,null,"（２棟以上の棟がある場合は、そのうち直近の時期について入力）"]
[null,null,null,null,null,null,null,null,null,"【Is値0.3未満】",null,"【Is値0.3以上0.6未満】"]
[null,null,null,null,null,null,null,null,"専門課程"]
[null,null,null,null,null,null,null,null,"高等課程"]
[null,null,null,null,null,null,null,null,"一般課程"]
[]
[null,"【c表】上記表（C表）へ回答した建物のうち、2階建て以上又は延べ床面積が200㎡以上の建物（非木造のものに限る）の数を下記表へ入力すること。",null,null,null,null,null,null,null,null,null,null,null,null,"(単位：棟）"]
[null,null,null,"生徒数が一番多い課程","全棟数","昭和57年以降の建築棟数\n（A-C）","昭和56年以前建築の棟数",null,null,null,null,null,null,null,null,null,null,"確認用チェック欄"]
[null,null,null,null,null,null,"昭和56年以前建築の棟数","耐震診断実施の棟数",null,null,null,null,null,null,"耐震診断未実施の棟数\n（C-D）",null,null,"「生徒数が一番多い課程」は「○」が一つ選択されているか","「全棟数」は記入されているか","「昭和57年以降の建築棟数」がマイナスになっていないか","「耐震診断未実施の棟数」がマイナスになっていないか","上記表を上回る棟数を入力している箇所がないか"]
[null,null,null,null,null,null,null,null,"耐震化済の棟数（Ｉｓ値0.6以上）",null,"改修予定有の棟数（Ｉｓ値0.6未満）",null,"改修予定無の棟数（Ｉｓ値0.6未満）"]
[null,null,null,null,null,null,null,"（E～Lの計）","改修の必要がない棟数","改修済の棟数","0.3未満","0.3以上0.6未満","0.3未満","0.3以上0.6未満"]
[null,null,null,null,"A","B","C","D","E","F","G","H","I","J","K"]
[null,"専門課程",null,{"$f":"IF(D92=\"\",\"\",D92)","v":""},null,{"$f":"E111-G111","v":0},null,{"$f":"SUM(I111:N111)","v":0},null,null,null,null,null,null,{"$f":"G111-H111","v":0},null,null,{"$f":"IF(COUNTA(E111:E113,G111:G113,I111:N113)=0,\"OK\",IF(COUNTIF(D111:D113,\"○\")=1,\"OK\",\"エラー\"))","v":"OK"},{"$f":"IF(COUNTA(G111,I111:N111)>=1,IF(E111<=0,\"エラー\",\"OK\"),\"OK\")","v":"OK"},{"$f":"IF(F111<0,\"エラー\",\"OK\")","v":"OK"},{"$f":"IF(O111<0,\"エラー\",\"OK\")","v":"OK"},{"$f":"IF(AND(E111<=E92,G111<=G92,I111<=I92,J111<=J92,K111<=K92,L111<=L92,M111<=M92,N111<=N92),\"OK\",\"エラー\")","v":"OK"}]
[null,"高等課程",null,{"$f":"IF(D93=\"\",\"\",D93)","v":""},null,{"$f":"E112-G112","v":0},null,{"$f":"SUM(I112:N112)","v":0},null,null,null,null,null,null,{"$f":"G112-H112","v":0},null,null,null,{"$f":"IF(COUNTA(G112,I112:N112)>=1,IF(E112<=0,\"エラー\",\"OK\"),\"OK\")","v":"OK"},{"$f":"IF(F112<0,\"エラー\",\"OK\")","v":"OK"},{"$f":"IF(O112<0,\"エラー\",\"OK\")","v":"OK"},{"$f":"IF(AND(E112<=E93,G112<=G93,I112<=I93,J112<=J93,K112<=K93,L112<=L93,M112<=M93,N112<=N93),\"OK\",\"エラー\")","v":"OK"}]
[null,"一般課程",null,{"$f":"IF(D94=\"\",\"\",D94)","v":""},null,{"$f":"E113-G113","v":0},null,{"$f":"SUM(I113:N113)","v":0},null,null,null,null,null,null,{"$f":"G113-H113","v":0},null,null,null,{"$f":"IF(COUNTA(G113,I113:N113)>=1,IF(E113<=0,\"エラー\",\"OK\"),\"OK\")","v":"OK"},{"$f":"IF(F113<0,\"エラー\",\"OK\")","v":"OK"},{"$f":"IF(O113<0,\"エラー\",\"OK\")","v":"OK"},{"$f":"IF(AND(E113<=E94,G113<=G94,I113<=I94,J113<=J94,K113<=K94,L113<=L94,M113<=M94,N113<=N94),\"OK\",\"エラー\")","v":"OK"}]
[null,"小　計",null,null,{"$f":"SUM(E111:E113)","v":0},{"$f":"SUM(F111:F113)","v":0},{"$f":"SUM(G111:G113)","v":0},0,0,0,0,0,0,0,0]
[]
[]
[null,null,null,null,null,null,null,"「改修予定有」の棟に関して、改修予定時期について入力"]
[null,null,null,null,null,null,null,"（２棟以上の棟がある場合は、そのうち直近の時期について入力）"]
[null,null,null,null,null,null,null,null,null,"【Is値0.3未満】",null,"【Is値0.3以上0.6未満】"]
[null,null,null,null,null,null,null,null,"専門課程"]
[null,null,null,null,null,null,null,null,"高等課程"]
[null,null,null,null,null,null,null,null,"一般課程"]
[]
[null,"【D表】面積で入力（C表で回答した建物の面積について記載すること）",null,null,null,null,null,null,null,null,null,null,null,"(単位：㎡）"]
[null,null,null,"生徒数が一番多い課程","全保有面積","昭和57年以降建築の面積\n（A-C）","昭和56年以前建築の面積",null,null,null,null,null,null,null,null,null,null,"確認用チェック欄"]
[null,null,null,null,null,null,"昭和56年以前建築の面積","耐震診断実施の面積",null,null,null,null,null,null,"耐震診断未実施の面積\n（C-D）",null,null,"「生徒数が一番多い課程」は「○」が一つ選択されているか","「全保有面積」は記入されているか","「昭和57年以降建築の面積」がマイナスになっていないか","「耐震診断未実施の面積」がマイナスになっていないか","「棟数」を回答した欄に回答しているか"]
[null,null,null,null,null,null,null,null,"耐震化済の面積（Ｉｓ値0.6以上）",null,"改修予定有の面積（Ｉｓ値0.6未満）",null,"改修予定無の面積（Ｉｓ値0.6未満）"]
[null,null,null,null,null,null,null,"（E～Lの計）","改修の必要がない棟の面積","改修済の棟の面積","0.3未満","0.3以上0.6未満","0.3未満","0.3以上0.6未満"]
[null,null,null,null,"A","B","C","D","E","F","G","H","I","J","K"]
[null,"専門課程",null,{"$f":"IF(D92=\"\",\"\",D92)","v":""},null,{"$f":"E130- G130","v":0},null,{"$f":"SUM(I130:N130)","v":0},null,null,null,null,null,null,{"$f":"+G130-H130","v":0},null,null,{"$f":"IF(COUNTA(E130:E132,G130:G132,I130:N132)=0,\"OK\",IF(COUNTIF(D130:D132,\"○\")=1,\"OK\",\"エラー\"))","v":"OK"},{"$f":"IF(COUNTA(G130,I130:N130)>=1,IF(E130<=0,\"エラー\",\"OK\"),\"OK\")","v":"OK"},{"$f":"IF(F130<0,\"エラー\",\"OK\")","v":"OK"},{"$f":"IF(O130<0,\"エラー\",\"OK\")","v":"OK"},{"$f":"IF(AND(COUNTA(E92)=COUNTA(E130),COUNTA(G92)=COUNTA(G130),COUNTA(I92)=COUNTA(I130),COUNTA(J92)=COUNTA(J130),COUNTA(K92)=COUNTA(K130),COUNTA(L92)=COUNTA(L130),COUNTA(M92)=COUNTA(M130),COUNTA(N92)=COUNTA(N130)),\"OK\",\"エラー\")","v":"OK"}]
[null,"高等課程",null,{"$f":"IF(D93=\"\",\"\",D93)","v":""},null,{"$f":"E131- G131","v":0},null,{"$f":"SUM(I131:N131)","v":0},null,null,null,null,null,null,{"$f":"+G131-H131","v":0},null,null,null,{"$f":"IF(COUNTA(G131,I131:N131)>=1,IF(E131<=0,\"エラー\",\"OK\"),\"OK\")","v":"OK"},{"$f":"IF(F131<0,\"エラー\",\"OK\")","v":"OK"},{"$f":"IF(O131<0,\"エラー\",\"OK\")","v":"OK"},{"$f":"IF(AND(COUNTA(E93)=COUNTA(E131),COUNTA(G93)=COUNTA(G131),COUNTA(I93)=COUNTA(I131),COUNTA(J93)=COUNTA(J131),COUNTA(K93)=COUNTA(K131),COUNTA(L93)=COUNTA(L131),COUNTA(M93)=COUNTA(M131),COUNTA(N93)=COUNTA(N131)),\"OK\",\"エラー\")","v":"OK"}]
[null,"一般課程",null,{"$f":"IF(D94=\"\",\"\",D94)","v":""},null,{"$f":"E132- G132","v":0},null,{"$f":"SUM(I132:N132)","v":0},null,null,null,null,null,null,{"$f":"+G132-H132","v":0},null,null,null,{"$f":"IF(COUNTA(G132,I132:N132)>=1,IF(E132<=0,\"エラー\",\"OK\"),\"OK\")","v":"OK"},{"$f":"IF(F132<0,\"エラー\",\"OK\")","v":"OK"},{"$f":"IF(O132<0,\"エラー\",\"OK\")","v":"OK"},{"$f":"IF(AND(COUNTA(E94)=COUNTA(E132),COUNTA(G94)=COUNTA(G132),COUNTA(I94)=COUNTA(I132),COUNTA(J94)=COUNTA(J132),COUNTA(K94)=COUNTA(K132),COUNTA(L94)=COUNTA(L132),COUNTA(M94)=COUNTA(M132),COUNTA(N94)=COUNTA(N132)),\"OK\",\"エラー\")","v":"OK"}]
[null,"小　計",null,null,{"$f":"SUM(E130:E132)","v":0},0,0,0,0,0,0,0,0,0,0]
[null,"※　小数第３位の値は四捨五入され、小数第２位までの表示となる。"]
[]
[null,"【d表】上記表（D表）へ回答した建物のうち、2階建て以上又は延べ床面積が200㎡以上の建物（非木造のものに限る）の数を下記表へ入力すること。"]
[null,"（c表に回答した建物の面積について記載すること）",null,null,null,null,null,null,null,null,null,null,null,null,"(単位：㎡）"]
[null,null,null,"生徒数が一番多い課程","全保有面積","昭和57年以降建築の面積\n（A-C）","昭和56年以前建築の面積",null,null,null,null,null,null,null,null,null,null,"確認用チェック欄"]
[null,null,null,null,null,null,"昭和56年以前建築の面積","耐震診断実施の面積",null,null,null,null,null,null,"耐震診断未実施の面積\n（C-D）",null,null,"「生徒数が一番多い課程」は「○」が一つ選択されているか","「全保有面積」は記入されているか","「昭和57年以降建築の面積」がマイナスになっていないか","「耐震診断未実施の面積」がマイナスになっていないか","「棟数」を回答した欄に回答しているか","上記表を上回る棟数を入力している箇所がないか"]
[null,null,null,null,null,null,null,null,"耐震化済の面積（Ｉｓ値0.6以上）",null,"改修予定有の面積（Ｉｓ値0.6未満）",null,"改修予定無の面積（Ｉｓ値0.6未満）"]
[null,null,null,null,null,null,null,"（E～Lの計）","改修の必要がない棟の面積","改修済の棟の面積","0.3未満","0.3以上0.6未満","0.3未満","0.3以上0.6未満"]
[null,null,null,null,"A","B","C","D","E","F","G","H","I","J","K"]
[null,"専門課程",null,{"$f":"IF(D92=\"\",\"\",D92)","v":""},null,{"$f":"E143- G143","v":0},null,{"$f":"SUM(I143:N143)","v":0},null,null,null,null,null,null,{"$f":"+G143-H143","v":0},null,null,{"$f":"IF(COUNTA(E143:E145,G143:G145,I143:N145)=0,\"OK\",IF(COUNTIF(D143:D145,\"○\")=1,\"OK\",\"エラー\"))","v":"OK"},{"$f":"IF(COUNTA(G143,I143:N143)>=1,IF(E143<=0,\"エラー\",\"OK\"),\"OK\")","v":"OK"},{"$f":"IF(F143<0,\"エラー\",\"OK\")","v":"OK"},{"$f":"IF(O143<0,\"エラー\",\"OK\")","v":"OK"},{"$f":"IF(AND(COUNTA(E111)=COUNTA(E143),COUNTA(G111)=COUNTA(G143),COUNTA(I111)=COUNTA(I143),COUNTA(J111)=COUNTA(J143),COUNTA(K111)=COUNTA(K143),COUNTA(L111)=COUNTA(L143),COUNTA(M111)=COUNTA(M143),COUNTA(N111)=COUNTA(N143)),\"OK\",\"エラー\")","v":"OK"},{"$f":"IF(AND(E143<=E130,G143<=G130,I143<=I130,J143<=J130,K143<=K130,L143<=L130,M143<=M130,N143<=N130),\"OK\",\"エラー\")","v":"OK"}]
[null,"高等課程",null,{"$f":"IF(D93=\"\",\"\",D93)","v":""},null,{"$f":"E144- G144","v":0},null,{"$f":"SUM(I144:N144)","v":0},null,null,null,null,null,null,{"$f":"+G144-H144","v":0},null,null,null,{"$f":"IF(COUNTA(G144,I144:N144)>=1,IF(E144<=0,\"エラー\",\"OK\"),\"OK\")","v":"OK"},{"$f":"IF(F144<0,\"エラー\",\"OK\")","v":"OK"},{"$f":"IF(O144<0,\"エラー\",\"OK\")","v":"OK"},{"$f":"IF(AND(COUNTA(E112)=COUNTA(E144),COUNTA(G112)=COUNTA(G144),COUNTA(I112)=COUNTA(I144),COUNTA(J112)=COUNTA(J144),COUNTA(K112)=COUNTA(K144),COUNTA(L112)=COUNTA(L144),COUNTA(M112)=COUNTA(M144),COUNTA(N112)=COUNTA(N144)),\"OK\",\"エラー\")","v":"OK"},{"$f":"IF(AND(E144<=E131,G144<=G131,I144<=I131,J144<=J131,K144<=K131,L144<=L131,M144<=M131,N144<=N131),\"OK\",\"エラー\")","v":"OK"}]
[null,"一般課程",null,{"$f":"IF(D94=\"\",\"\",D94)","v":""},null,{"$f":"E145- G145","v":0},null,{"$f":"SUM(I145:N145)","v":0},null,null,null,null,null,null,{"$f":"+G145-H145","v":0},null,null,null,{"$f":"IF(COUNTA(G145,I145:N145)>=1,IF(E145<=0,\"エラー\",\"OK\"),\"OK\")","v":"OK"},{"$f":"IF(F145<0,\"エラー\",\"OK\")","v":"OK"},{"$f":"IF(O145<0,\"エラー\",\"OK\")","v":"OK"},{"$f":"IF(AND(COUNTA(E113)=COUNTA(E145),COUNTA(G113)=COUNTA(G145),COUNTA(I113)=COUNTA(I145),COUNTA(J113)=COUNTA(J145),COUNTA(K113)=COUNTA(K145),COUNTA(L113)=COUNTA(L145),COUNTA(M113)=COUNTA(M145),COUNTA(N113)=COUNTA(N145)),\"OK\",\"エラー\")","v":"OK"},{"$f":"IF(AND(E145<=E132,G145<=G132,I145<=I132,J145<=J132,K145<=K132,L145<=L132,M145<=M132,N145<=N132),\"OK\",\"エラー\")","v":"OK"}]
[null,"小　計",null,null,{"$f":"SUM(E143:E145)","v":0},0,0,0,0,0,0,0,0,0,0]
[null,"※　小数第３位の値は四捨五入され、小数第２位までの表示となる。",null,null,null,null,null,null,null,null,null,null,null,null,1]
[]
[null,"合計（全棟数）"]
[null,null,null,"生徒数が一番多い課程","全棟数","昭和57年以降の建築棟数\n（A-C）","昭和56年以前建築の棟数",null,null,null,null,null,null,null,null,"耐震化率\n（％）\n（B＋E＋F）/A"]
[null,null,null,null,null,null,"昭和56年以前建築の棟数","耐震診断実施の棟数",null,null,null,null,null,null,"耐震診断未実施の棟数\n（C-D）"]
[null,null,null,null,null,null,null,null,"耐震化済の棟数（Ｉｓ値0.6以上）",null,"改修予定有の棟数（Ｉｓ値0.6未満）",null,"改修予定無の棟数（Ｉｓ値0.6未満）"]
[null,null,null,null,null,null,null,"（E～Lの計）","改修の必要がない棟数","改修済の棟数","0.3未満","0.3以上0.6未満","0.3未満","0.3以上0.6未満"]
[null,null,null,null,"A","B","C","D","E","F","G","H","I","J","K","L"]
[null,"専門課程",null,{"$f":"D92&D27","v":""},{"$f":"SUM(E27,E92)","v":0},{"$f":"E155-G155","v":0},{"$f":"SUM(G27,G92)","v":0},{"$f":"SUM(I155:N155)","v":0},{"$f":"SUM(I27,I92)","v":0},0,0,0,0,0,{"$f":"G155-H155","v":0},{"$f":"(F155+I155+J155)/E155","v":{"$error":"#DIV/0!"}}]
[null,"高等課程",null,{"$f":"D93&D28","v":""},{"$f":"SUM(E28,E93)","v":0},{"$f":"E156-G156","v":0},{"$f":"SUM(G28,G93)","v":0},{"$f":"SUM(I156:N156)","v":0},0,0,0,0,0,0,{"$f":"G156-H156","v":0},{"$f":"(F156+I156+J156)/E156","v":{"$error":"#DIV/0!"}}]
[null,"一般課程",null,{"$f":"D94&D29","v":""},{"$f":"SUM(E29,E94)","v":0},{"$f":"E157-G157","v":0},{"$f":"SUM(G29,G94)","v":0},{"$f":"SUM(I157:N157)","v":0},0,0,0,0,0,0,{"$f":"G157-H157","v":0},{"$f":"(F157+I157+J157)/E157","v":{"$error":"#DIV/0!"}}]
[null,"小　計",null,null,{"$f":"SUM(E155:E157)","v":0},{"$f":"SUM(F155:F157)","v":0},{"$f":"SUM(G155:G157)","v":0},0,0,0,0,0,0,0,0,{"$f":"(F158+I158+J158)/E158","v":{"$error":"#DIV/0!"}}]
[]
[null,"合計（200㎡以上棟数）"]
[null,null,null,"生徒数が一番多い課程","全棟数","昭和57年以降の建築棟数\n（A-C）","昭和56年以前建築の棟数",null,null,null,null,null,null,null,null,"耐震化率\n（％）\n（B＋E＋F）/A"]
[null,null,null,null,null,null,"昭和56年以前建築の棟数","耐震診断実施の棟数",null,null,null,null,null,null,"耐震診断未実施の棟数\n（C-D）"]
[null,null,null,null,null,null,null,null,"耐震化済の棟数（Ｉｓ値0.6以上）",null,"改修予定有の棟数（Ｉｓ値0.6未満）",null,"改修予定無の棟数（Ｉｓ値0.6未満）"]
[null,null,null,null,null,null,null,"（E～Lの計）","改修の必要がない棟数","改修済の棟数","0.3未満","0.3以上0.6未満","0.3未満","0.3以上0.6未満"]
[null,null,null,null,"A","B","C","D","E","F","G","H","I","J","K","L"]
[null,"専門課程",null,{"$f":"D111&D47","v":""},{"$f":"SUM(E47,E111)","v":0},{"$f":"E166-G166","v":0},{"$f":"SUM(G47,G111)","v":0},{"$f":"SUM(I166:N166)","v":0},{"$f":"SUM(I47,I111)","v":0},0,0,0,0,0,{"$f":"G166-H166","v":0},{"$f":"(F166+I166+J166)/E166","v":{"$error":"#DIV/0!"}}]
[null,"高等課程",null,{"$f":"D112&D48","v":""},{"$f":"SUM(E48,E112)","v":0},{"$f":"E167-G167","v":0},{"$f":"SUM(G48,G112)","v":0},{"$f":"SUM(I167:N167)","v":0},0,0,0,0,0,0,{"$f":"G167-H167","v":0},{"$f":"(F167+I167+J167)/E167","v":{"$error":"#DIV/0!"}}]
[null,"一般課程",null,{"$f":"D113&D49","v":""},{"$f":"SUM(E49,E113)","v":0},{"$f":"E168-G168","v":0},{"$f":"SUM(G49,G113)","v":0},{"$f":"SUM(I168:N168)","v":0},0,0,0,0,0,0,{"$f":"G168-H168","v":0},{"$f":"(F168+I168+J168)/E168","v":{"$error":"#DIV/0!"}}]
[null,"小　計",null,null,{"$f":"SUM(E166:E168)","v":0},{"$f":"SUM(F166:F168)","v":0},{"$f":"SUM(G166:G168)","v":0},0,0,0,0,0,0,0,0,{"$f":"(F169+I169+J169)/E169","v":{"$error":"#DIV/0!"}}]
[]
[null,"○学校数で入力・・・１（学校ごとに避難所指定がされていた場合（片方の表のみ回答））",null,null,null,null,null,null,null,null,"(単位：学校数）"]
[null,null,null,"生徒数が一番多い課程","学校数","昭和57年以降建築\n（A-C）",null,"昭和56年以前建築",null,null,null,"耐震化率\n（％）\n（B＋E＋F）/A"]
[null,null,null,null,null,null,"昭和56年以前建築","耐震診断実施済",null,null,"耐震診断未実施\n（C-D）"]
[null,null,null,null,null,null,null,"全ての建物が新耐震基準に適合している","うち、新耐震基準に適合しない建物があり、全て耐震改修済み","うち新耐震基準に適合しない建物があり、未改修の建物がある学校数"]
[]
[null,null,null,null,"A","B","C","D","E","F","G"]
[null,"専門課程",null,{"$f":"D155","v":""},{"$f":"COUNTIF(D177,\"○\")","v":0},{"$f":"IF(AND(E177>=1,G155=0),1,0)","v":0},{"$f":"IF(AND(E177>=1,G155>=1),1,0)","v":0},{"$f":"IF(AND(E177>=1,I155>=1,J155+K155+L155+M155+N155=0,O155=0),1,0)","v":0},{"$f":"IF(AND(E177>=1,J155>=1,K155+L155+M155+N155=0,O155=0),1,0)","v":0},{"$f":"IF(AND(G177>=1,K155+L155+M155+N155>=1,O155=0),1,0)","v":0},{"$f":"IF(AND(E177>=1,O155>=1),\"○\",\"-\")","v":"-"},{"$f":"(F180+H180+I180)/E180","v":{"$error":"#DIV/0!"}}]
[null,"高等課程",null,{"$f":"D156","v":""},{"$f":"COUNTIF(D178,\"○\")","v":0},{"$f":"IF(AND(E178>=1,G156=0),1,0)","v":0},{"$f":"IF(AND(E178>=1,G156>=1),1,0)","v":0},{"$f":"IF(AND(E178>=1,I156>=1,J156+K156+L156+M156+N156=0,O156=0),1,0)","v":0},{"$f":"IF(AND(E178>=1,J156>=1,K156+L156+M156+N156=0,O156=0),1,0)","v":0},{"$f":"IF(AND(G178>=1,K156+L156+M156+N156>=1,O156=0),1,0)","v":0},{"$f":"IF(AND(E178>=1,O156>=1),\"○\",\"-\")","v":"-"}]
[null,"一般課程",null,{"$f":"D157","v":""},{"$f":"COUNTIF(D179,\"○\")","v":0},{"$f":"IF(AND(E179>=1,G157=0),1,0)","v":0},{"$f":"IF(AND(E179>=1,G157>=1),1,0)","v":0},{"$f":"IF(AND(E179>=1,I157>=1,J157+K157+L157+M157+N157=0,O157=0),1,0)","v":0},{"$f":"IF(AND(E179>=1,J157>=1,K157+L157+M157+N157=0,O157=0),1,0)","v":0},{"$f":"IF(AND(G179>=1,K157+L157+M157+N157>=1,O157=0),1,0)","v":0},{"$f":"IF(AND(E179>=1,O157>=1),\"○\",\"-\")","v":"-"}]
[null,"小　計",null,null,{"$f":"SUM(E177:E179)","v":0},0,0,0,0,0]
[]
[null,"○学校数で入力・・・２（建物ごとに避難所指定がされていた場合（両方の表へ回答））",null,null,null,null,null,null,null,null,"(単位：学校数）"]
[null,null,null,"生徒数が一番多い課程","学校数","昭和57年以降建築\n（A-C）",null,"昭和56年以前建築",null,null,null,"耐震化率\n（％）\n（B＋E＋F）/A"]
[null,null,null,null,null,null,"昭和56年以前建築","耐震診断実施済",null,null,"耐震診断未実施\n（C-D）"]
[null,null,null,null,null,null,null,"全ての建物が新耐震基準に適合している","うち、新耐震基準に適合しない建物があり、全て耐震改修済み","うち新耐震基準に適合しない建物があり、未改修の建物がある学校数"]
[]
[null,null,null,null,"A","B","C","D","E","F","G"]
[null,"専門課程",null,{"$f":"IF(D177=\"\",\"\",D177)","v":""},{"$f":"COUNTIF(D188,\"○○\")","v":0},{"$f":"IF(AND(E188>=1,G155=0),1,0)","v":0},{"$f":"IF(AND(E188>=1,G155>=1),1,0)","v":0},{"$f":"IF(AND(E188>=1,I155>=1,J155+K155+L155+M155+N155=0,O155=0),1,0)","v":0},{"$f":"IF(AND(E188>=1,J155>=1,K155+L155+M155+N155=0, O155=0),1,0)","v":0},{"$f":"IF(AND(E188>=1,K155+L155+M155+N155>=1,O155=0),1,0)","v":0},{"$f":"IF(AND(E188>=1,O155>=1),\"○\",\"-\")","v":"-"},{"$f":"(F191+H191+I191)/E191","v":{"$error":"#DIV/0!"}}]
[null,"高等課程",null,{"$f":"IF(D178=\"\",\"\",D178)","v":""},{"$f":"COUNTIF(D189,\"○○\")","v":0},{"$f":"IF(AND(E189>=1,G156=0),1,0)","v":0},{"$f":"IF(AND(E189>=1,G156>=1),1,0)","v":0},{"$f":"IF(AND(E189>=1,I156>=1,J156+K156+L156+M156+N156=0,O156=0),1,0)","v":0},{"$f":"IF(AND(E189>=1,J156>=1,K156+L156+M156+N156=0, O156=0),1,0)","v":0},{"$f":"IF(AND(E189>=1,K156+L156+M156+N156>=1,O156=0),1,0)","v":0},{"$f":"IF(AND(E189>=1,O156>=1),\"○\",\"-\")","v":"-"}]
[null,"一般課程",null,{"$f":"IF(D179=\"\",\"\",D179)","v":""},{"$f":"COUNTIF(D190,\"○○\")","v":0},{"$f":"IF(AND(E190>=1,G157=0),1,0)","v":0},{"$f":"IF(AND(E190>=1,G157>=1),1,0)","v":0},{"$f":"IF(AND(E190>=1,I157>=1,J157+K157+L157+M157+N157=0,O157=0),1,0)","v":0},{"$f":"IF(AND(E190>=1,J157>=1,K157+L157+M157+N157=0, O157=0),1,0)","v":0},{"$f":"IF(AND(E190>=1,K157+L157+M157+N157>=1,O157=0),1,0)","v":0},{"$f":"IF(AND(E190>=1,O157>=1),\"○\",\"-\")","v":"-"}]
[null,"小　計",null,null,{"$f":"SUM(E188:E190)","v":0},0,{"$f":"SUM(G188:G190)","v":0},0,0,0]
[]
[null,"○学校数で入力・・・３（１と２の合計）",null,null,null,null,null,null,null,null,"(単位：学校数）"]
[null,"小　計",null,null,{"$f":"E180+E191","v":0},0,0,0,0,0,{"$f":"COUNTIF(K177:K179,\"○\")+COUNTIF(K188:K190,\"○\")","v":0},{"$f":"(F194+H194+I194)/E194","v":{"$error":"#DIV/0!"}}]
[null,"合計",null,null,null,null,null,null,null,null,null,null,null,"(単位：㎡）"]
[null,null,null,"生徒数が一番多い課程","全保有面積","昭和57年以降建築の面積\n（A-C）","昭和56年以前建築の面積",null,null,null,null,null,null,null,null,"耐震化率\n（％）\n（B＋E＋F）/A"]
[null,null,null,null,null,null,"昭和56年以前建築の面積","耐震診断実施の面積",null,null,null,null,null,null,"耐震診断未実施の面積\n（C-D）"]
[null,null,null,null,null,null,null,null,"耐震化済の面積（Ｉｓ値0.6以上）",null,"改修予定有の面積（Ｉｓ値0.6未満）",null,"改修予定無の面積（Ｉｓ値0.6未満）"]
[null,null,null,null,null,null,null,"（E～Lの計）","改修の必要がない棟の面積","改修済の棟の面積","0.3未満","0.3以上0.6未満","0.3未満","0.3以上0.6未満"]
[null,null,null,null,"A","B","C","D","E","F","G","H","I","J","K","L"]
[null,"専門課程",null,{"$f":"D155","v":""},{"$f":"SUM(E66,E130)","v":0},{"$f":"E201- G201","v":0},{"$f":"SUM(G66,G130)","v":0},{"$f":"SUM(I201:N201)","v":0},{"$f":"SUM(I66,I130)","v":0},0,0,0,0,0,{"$f":"+G201-H201","v":0},{"$f":"(F201+I201+J201)/E201","v":{"$error":"#DIV/0!"}}]
[null,"高等課程",null,{"$f":"D156","v":""},{"$f":"SUM(E67,E131)","v":0},{"$f":"E202- G202","v":0},{"$f":"SUM(G67,G131)","v":0},{"$f":"SUM(I202:N202)","v":0},0,0,0,0,0,0,{"$f":"+G202-H202","v":0},{"$f":"(F202+I202+J202)/E202","v":{"$error":"#DIV/0!"}}]
[null,"一般課程",null,{"$f":"D157","v":""},{"$f":"SUM(E68,E132)","v":0},{"$f":"E203- G203","v":0},{"$f":"SUM(G68,G132)","v":0},{"$f":"SUM(I203:N203)","v":0},0,0,0,0,0,0,{"$f":"+G203-H203","v":0},{"$f":"(F203+I203+J203)/E203","v":{"$error":"#DIV/0!"}}]
[null,"小　計",null,null,{"$f":"SUM(E201:E203)","v":0},0,0,0,0,0,0,0,0,0,0,{"$f":"(F204+I204+J204)/E204","v":{"$error":"#DIV/0!"}}]
[]
[null,"合計（200㎡以上棟数）",null,null,null,null,null,null,null,null,null,null,null,"(単位：㎡）"]
[null,null,null,"生徒数が一番多い課程","全保有面積","昭和57年以降建築の面積\n（A-C）","昭和56年以前建築の面積",null,null,null,null,null,null,null,null,"耐震化率\n（％）\n（B＋E＋F）/A"]
[null,null,null,null,null,null,"昭和56年以前建築の面積","耐震診断実施の面積",null,null,null,null,null,null,"耐震診断未実施の面積\n（C-D）"]
[null,null,null,null,null,null,null,null,"耐震化済の面積（Ｉｓ値0.6以上）",null,"改修予定有の面積（Ｉｓ値0.6未満）",null,"改修予定無の面積（Ｉｓ値0.6未満）"]
[null,null,null,null,null,null,null,"（E～Lの計）","改修の必要がない棟の面積","改修済の棟の面積","0.3未満","0.3以上0.6未満","0.3未満","0.3以上0.6未満"]
[null,null,null,null,"A","B","C","D","E","F","G","H","I","J","K","L"]
[null,"専門課程",null,{"$f":"D201","v":""},{"$f":"SUM(E79,E143)","v":0},{"$f":"E212- G212","v":0},{"$f":"SUM(G79,G143)","v":0},{"$f":"SUM(I212:N212)","v":0},{"$f":"SUM(I79,I143)","v":0},0,0,0,0,0,{"$f":"+G212-H212","v":0},{"$f":"(F212+I212+J212)/E212","v":{"$error":"#DIV/0!"}}]
[null,"高等課程",null,{"$f":"D202","v":""},{"$f":"SUM(E80,E144)","v":0},{"$f":"E213- G213","v":0},{"$f":"SUM(G80,G144)","v":0},{"$f":"SUM(I213:N213)","v":0},0,0,0,0,0,0,{"$f":"+G213-H213","v":0},{"$f":"(F213+I213+J213)/E213","v":{"$error":"#DIV/0!"}}]
[null,"一般課程",null,{"$f":"D203","v":""},{"$f":"SUM(E81,E145)","v":0},{"$f":"E214- G214","v":0},{"$f":"SUM(G81,G145)","v":0},{"$f":"SUM(I214:N214)","v":0},0,0,0,0,0,0,{"$f":"+G214-H214","v":0},{"$f":"(F214+I214+J214)/E214","v":{"$error":"#DIV/0!"}}]
[null,"小　計",null,null,{"$f":"SUM(E212:E214)","v":0},0,0,0,0,0,0,0,0,0,0,{"$f":"(F215+I215+J215)/E215","v":{"$error":"#DIV/0!"}}]
[]
[]
[null,null,null,null,null,null,null,null,null,null,null,null,{"$f":"IF(COUNTIF(R22:W145,\"エラー\")=0,\"OK\",\"エラー\")","v":"OK"}]
[]
[]
[]
[null,null,null,null,null,null,null,null,null,null,null,null,{"$f":"IF(M218=\"エラー\",\"右欄外のエラー欄を確認し、エラーが出ている箇所を修正してください\",\"\")","v":""}]

{"sheet":"（回答不用）様式３－２－７－２","index":8,"n_rows":221,"n_cols":23,"rows_kept":221,"cut":false,"hidden":false,"merged":[[216,12,218,13],[220,12,220,16],[207,10,207,11],[207,12,207,13],[210,1,210,2],[211,1,211,2],[212,1,212,2],[213,1,213,2],[205,1,209,2],[205,3,209,3],[205,4,208,4],[205,5,208,5],[205,6,205,14],[205,15,208,15],[206,6,208,6],[206,7,206,13],[206,14,208,14],[207,8,207,9],[199,1,199,2],[200,1,200,2],[201,1,201,2],[202,1,202,2],[204,1,204,2],[204,13,204,15],[195,6,197,6],[195,7,195,13],[195,14,197,14],[196,8,196,9],[196,10,196,11],[196,12,196,13],[191,1,191,8],[191,10,191,11],[192,1,192,2],[193,13,193,15],[194,1,198,2],[194,3,198,3],[194,4,197,4],[194,5,197,5],[194,6,194,14],[194,15,197,15],[186,1,186,2],[186,11,188,11],[187,1,187,2],[188,1,188,2],[189,1,189,2],[189,10,189,11],[182,6,184,6],[182,7,182,9],[182,10,184,10],[183,7,184,7],[183,8,184,8],[183,9,184,9],[178,1,178,2],[178,10,178,11],[180,1,180,9],[180,10,180,11],[181,1,185,2],[181,3,185,3],[181,4,184,4],[181,5,184,5],[181,7,181,10],[181,11,185,11],[175,1,175,2],[175,11,177,11],[176,1,176,2],[177,1,177,2],[170,1,174,2],[170,3,174,3],[170,4,173,4],[170,5,173,5],[170,7,170,10],[170,11,174,11],[171,6,173,6],[171,7,171,9],[171,10,173,10],[172,7,173,7],[172,8,173,8],[172,9,173,9],[164,1,164,2],[165,1,165,2],[166,1,166,2],[167,1,167,2],[169,1,169,9],[169,10,169,11],[159,6,159,14],[159,15,162,15],[160,6,162,6],[160,7,160,13],[160,14,162,14],[161,8,161,9],[161,10,161,11],[161,12,161,13],[150,12,150,13],[158,1,158,2],[159,1,163,2],[159,3,163,3],[159,4,162,4],[159,5,162,5],[153,1,153,2],[154,1,154,2],[155,1,155,2],[156,1,156,2],[141,1,141,2],[141,17,143,17],[142,1,142,2],[143,1,143,2],[144,1,144,2],[145,1,145,13],[148,4,151,4],[148,5,151,5],[137,18,140,18],[136,1,140,2],[136,3,140,3],[136,4,139,4],[136,5,139,5],[136,6,136,14],[136,17,136,22],[148,1,152,2],[148,3,152,3],[148,6,148,14],[148,15,151,15],[149,6,151,6],[149,7,149,13],[149,14,151,14],[150,8,150,9],[150,10,150,11],[137,19,140,19],[137,20,140,20],[137,21,140,21],[137,6,139,6],[137,7,137,13],[137,14,139,14],[137,17,140,17],[137,22,140,22],[138,8,138,9],[138,10,138,11],[138,12,138,13],[128,1,128,2],[128,17,130,17],[129,1,129,2],[130,1,130,2],[131,1,131,2],[132,1,132,12],[123,17,123,21],[124,6,126,6],[124,7,124,13],[124,14,126,14],[124,17,127,17],[124,18,127,18],[124,19,127,19],[124,20,127,20],[124,21,127,21],[125,8,125,9],[120,9,120,10],[120,11,120,12],[122,13,122,14],[123,1,127,2],[123,3,127,3],[123,4,126,4],[123,5,126,5],[123,6,123,14],[125,10,125,11],[125,12,125,13],[116,7,116,14],[117,9,117,10],[117,11,117,12],[118,9,118,10],[118,11,118,12],[119,9,119,10],[119,11,119,12],[109,1,109,2],[109,17,111,17],[110,1,110,2],[111,1,111,2],[112,1,112,2],[115,7,115,14],[104,17,104,21],[105,6,107,6],[105,7,105,13],[105,14,107,14],[105,17,108,17],[105,18,108,18],[105,19,108,19],[105,20,108,20],[105,21,108,21],[106,8,106,9],[101,9,101,10],[101,11,101,12],[104,1,108,2],[104,3,108,3],[104,4,107,4],[104,5,107,5],[104,6,104,14],[106,10,106,11],[106,12,106,13],[97,7,97,14],[98,9,98,10],[98,11,98,12],[99,9,99,10],[99,11,99,12],[100,9,100,10],[100,11,100,12],[90,1,90,2],[90,17,92,17],[91,1,91,2],[92,1,92,2],[93,1,93,2],[96,7,96,14],[84,13,84,14],[85,1,89,2],[85,3,89,3],[85,4,88,4],[85,5,88,5],[85,6,85,14],[87,12,87,13],[77,1,77,2],[77,17,79,17],[78,1,78,2],[79,1,79,2],[80,1,80,2],[81,1,81,13],[85,17,85,20],[86,6,88,6],[86,7,86,13],[86,14,88,14],[86,17,89,17],[86,18,89,18],[86,19,89,19],[86,20,89,20],[87,8,87,9],[87,10,87,11],[72,17,72,22],[73,6,75,6],[73,7,73,13],[73,14,75,14],[73,17,76,17],[73,18,76,18],[73,19,76,19],[73,20,76,20],[73,21,76,21],[73,22,76,22],[71,13,71,14],[72,1,76,2],[72,3,76,3],[72,4,75,4],[72,5,75,5],[72,6,72,14],[74,8,74,9],[74,10,74,11],[74,12,74,13],[64,1,64,2],[64,17,66,17],[65,1,65,2],[66,1,66,2],[67,1,67,2],[68,1,68,13],[59,17,59,21],[60,6,62,6],[60,7,60,13],[60,14,62,14],[60,17,63,17],[60,18,63,18],[60,19,63,19],[60,20,63,20],[60,21,63,21],[61,8,61,9],[56,9,56,10],[56,11,56,12],[58,13,58,14],[59,1,63,2],[59,3,63,3],[59,4,62,4],[59,5,62,5],[59,6,59,14],[61,10,61,11],[61,12,61,13],[52,7,52,14],[53,9,53,10],[53,11,53,12],[54,9,54,10],[54,11,54,12],[55,9,55,10],[55,11,55,12],[45,1,45,2],[45,17,47,17],[46,1,46,2],[47,1,47,2],[48,1,48,2],[51,7,51,14],[40,17,40,21],[41,6,43,6],[41,7,41,13],[41,14,43,14],[41,17,44,17],[41,18,44,18],[41,19,44,19],[41,20,44,20],[41,21,44,21],[42,8,42,9],[37,9,37,10],[37,11,37,12],[40,1,44,2],[40,3,44,3],[40,4,43,4],[40,5,43,5],[40,6,40,14],[42,10,42,11],[42,12,42,13],[33,7,33,14],[34,9,34,10],[34,11,34,12],[35,9,35,10],[35,11,35,12],[36,9,36,10],[36,11,36,12],[26,1,26,2],[26,17,28,17],[27,1,27,2],[28,1,28,2],[29,1,29,2],[32,7,32,14],[22,18,25,18],[22,19,25,19],[22,20,25,20],[23,8,23,9],[23,10,23,11],[23,12,23,13],[21,1,25,2],[21,3,25,3],[21,4,24,4],[21,5,24,5],[21,6,21,14],[21,17,21,20],[22,6,24,6],[22,7,22,13],[22,14,24,14],[22,17,25,17],[8,17,8,18],[9,17,9,18],[10,17,10,18],[11,17,11,18],[12,17,12,18],[20,13,20,14],[2,1,2,7],[3,17,3,18],[4,17,4,18],[5,17,5,18],[6,17,6,18],[7,17,7,18]]}
[null,"様式３－２－７－２"]
[null,"校舎施設の状況（借用）"]
[null,"専修学校の耐震化状況（令和元年年5月1日時点）"]
[null,null,null,null,null,null,null,null,null,null,null,null,null,null,null,null,null,"都道府県名 1)",null,{"$error":"#REF!"}]
[null,null,null,null,null,null,null,null,null,null,null,null,null,null,null,null,null,"設置者名",null,{"$error":"#REF!"}]
[null,null,null,null,null,null,null,null,null,null,null,null,null,null,null,null,null,"設置者の種別 2)",null,{"$error":"#REF!"}]
[null,null,null,null,null,null,null,null,null,null,null,null,null,null,null,null,null,"（その他の法人の場合：　　　　　　　　　　　　　　　　　　　　　　　　　　　　　　　　　　）",null,"（その他の法人の場合：　　　　　　　　　　　　　　　　　　　　）"]
[null,null,null,null,null,null,null,null,null,null,null,null,null,null,null,null,null,"学校名",null,{"$error":"#REF!"}]
[null,null,null,null,null,null,null,null,null,null,null,null,null,null,null,null,null,"学校基本調査番号 3)",null,{"$error":"#REF!"}]
[null,null,null,null,null,null,null,null,null,null,null,null,null,null,null,null,null,"法人番号 4)",null,{"$error":"#REF!"}]
[null,null,null,null,null,null,null,null,null,null,null,null,null,null,null,null,null,"担当者名 5)",null,{"$error":"#REF!"}]
[null,null,null,null,null,null,null,null,null,null,null,null,null,null,null,null,null,"担当者の直通電話",null,{"$error":"#REF!"}]
[null,null,null,null,null,null,null,null,null,null,null,null,null,null,null,null,null,"担当者のemail",null,{"$error":"#REF!"}]
[]
[]
[]
[]
[]
[null,"【避難所指定を受けている学校】"]
[]
[null,"【A表】棟数で入力",null,null,null,null,null,null,null,null,null,null,null,"(単位：棟）"]
[null,null,null,"生徒数が一番多い課程","全棟数","昭和57年以降の建築棟数\n（A-C）","昭和56年以前建築の棟数",null,null,null,null,null,null,null,null,null,null,"確認用チェック欄"]
[null,null,null,null,null,null,"昭和56年以前建築の棟数","耐震診断実施の棟数",null,null,null,null,null,null,"耐震診断未実施の棟数\n（C-D）",null,null,"「生徒数が一番多い課程」は「○」が一つ選択されているか","「全棟数」は記入されているか","「昭和57年以降の建築棟数」がマイナスになっていないか","「耐震診断未実施の棟数」がマイナスになっていないか"]
[null,null,null,null,null,null,null,null,"耐震化済の棟数（Ｉｓ値0.6以上）",null,"改修予定有の棟数（Ｉｓ値0.6未満）",null,"改修予定無の棟数（Ｉｓ値0.6未満）"]
[null,null,null,null,null,null,null,"（E～Jの計）","改修の必要がない棟数","改修済の棟数","0.3未満","0.3以上0.6未満","0.3未満","0.3以上0.6未満"]
[null,null,null,null,"A","B","C","D","E","F","G","H","I","J","K"]
[null,"専門課程",null,null,null,{"$f":"E27-G27","v":0},null,{"$f":"SUM(I27:N27)","v":0},null,null,null,null,null,null,{"$f":"G27-H27","v":0},null,null,{"$f":"IF(COUNTA(E27:E29,G27:G29,I27:N29)=0,\"OK\",IF(COUNTIF(D27:D29,\"○\")=1,\"OK\",\"エラー\"))","v":"OK"},{"$f":"IF(COUNTA(G27,I27:N27)>=1,IF(E27<=0,\"エラー\",\"OK\"),\"OK\")","v":"OK"},{"$f":"IF(F27<0,\"エラー\",\"OK\")","v":"OK"},{"$f":"IF(O27<0,\"エラー\",\"OK\")","v":"OK"}]
[null,"高等課程",null,null,null,{"$f":"E28-G28","v":0},null,{"$f":"SUM(I28:N28)","v":0},null,null,null,null,null,null,{"$f":"G28-H28","v":0},null,null,null,{"$f":"IF(COUNTA(G28,I28:N28)>=1,IF(E28<=0,\"エラー\",\"OK\"),\"OK\")","v":"OK"},{"$f":"IF(F28<0,\"エラー\",\"OK\")","v":"OK"},{"$f":"IF(O28<0,\"エラー\",\"OK\")","v":"OK"}]
[null,"一般課程",null,null,null,{"$f":"E29-G29","v":0},null,{"$f":"SUM(I29:N29)","v":0},null,null,null,null,null,null,{"$f":"G29-H29","v":0},null,null,null,{"$f":"IF(COUNTA(G29,I29:N29)>=1,IF(E29<=0,\"エラー\",\"OK\"),\"OK\")","v":"OK"},{"$f":"IF(F29<0,\"エラー\",\"OK\")","v":"OK"},{"$f":"IF(O29<0,\"エラー\",\"OK\")","v":"OK"}]
[null,"小　計",null,null,{"$f":"SUM(E27:E29)","v":0},{"$f":"SUM(F27:F29)","v":0},0,0,0,0,0,0,0,0,0]
[]
[]
[null,null,null,null,null,null,null,"「改修予定有」の棟に関して、改修予定時期について入力"]
[null,null,null,null,null,null,null,"（２棟以上の棟がある場合は、そのうち直近の時期について入力）"]
[null,null,null,null,null,null,null,null,null,"【Is値0.3未満】",null,"【Is値0.3以上0.6未満】"]
[null,null,null,null,null,null,null,null,"専門課程"]
[null,null,null,null,null,null,null,null,"高等課程"]
[null,null,null,null,null,null,null,null,"一般課程"]
[]
[null,"【a表】上記表（A表）へ回答した建物のうち、2階建て以上又は延べ床面積が200㎡以上の建物（非木造のものに限る）の数を下記表へ入力すること。",null,null,null,null,null,null,null,null,null,null,null,null,"(単位：棟）"]
[null,null,null,"生徒数が一番多い課程","全棟数","昭和57年以降の建築棟数\n（A-C）","昭和56年以前建築の棟数",null,null,null,null,null,null,null,null,null,null,"確認用チェック欄"]
[null,null,null,null,null,null,"昭和56年以前建築の棟数","耐震診断実施の棟数",null,null,null,null,null,null,"耐震診断未実施の棟数\n（C-D）",null,null,"「生徒数が一番多い課程」は「○」が一つ選択されているか","「全棟数」は記入されているか","「昭和57年以降の建築棟数」がマイナスになっていないか","「耐震診断未実施の棟数」がマイナスになっていないか","上記表を上回る棟数を入力している箇所がないか"]
[null,null,null,null,null,null,null,null,"耐震化済の棟数（Ｉｓ値0.6以上）",null,"改修予定有の棟数（Ｉｓ値0.6未満）",null,"改修予定無の棟数（Ｉｓ値0.6未満）"]
[null,null,null,null,null,null,null,"（E～Jの計）","改修の必要がない棟数","改修済の棟数","0.3未満","0.3以上0.6未満","0.3未満","0.3以上0.6未満"]
[null,null,null,null,"A","B","C","D","E","F","G","H","I","J","K"]
[null,"専門課程",null,{"$f":"IF(D27=\"\",\"\",D27)","v":""},null,{"$f":"E46-G46","v":0},null,{"$f":"SUM(I46:N46)","v":0},null,null,null,null,null,null,{"$f":"G46-H46","v":0},null,null,{"$f":"IF(COUNTA(E46:E48,G46:G48,I46:N48)=0,\"OK\",IF(COUNTIF(D46:D48,\"○\")=1,\"OK\",\"エラー\"))","v":"OK"},{"$f":"IF(COUNTA(G46,I46:N46)>=1,IF(E46<=0,\"エラー\",\"OK\"),\"OK\")","v":"OK"},{"$f":"IF(F46<0,\"エラー\",\"OK\")","v":"OK"},{"$f":"IF(O46<0,\"エラー\",\"OK\")","v":"OK"},{"$f":"IF(AND(E46<=E27,G46<=G27,I46<=I27,J46<=J27,K46<=K27,L46<=L27,M46<=M27,N46<=N27),\"OK\",\"エラー\")","v":"OK"}]
[null,"高等課程",null,{"$f":"IF(D28=\"\",\"\",D28)","v":""},null,{"$f":"E47-G47","v":0},null,{"$f":"SUM(I47:N47)","v":0},null,null,null,null,null,null,{"$f":"G47-H47","v":0},null,null,null,{"$f":"IF(COUNTA(G47,I47:N47)>=1,IF(E47<=0,\"エラー\",\"OK\"),\"OK\")","v":"OK"},{"$f":"IF(F47<0,\"エラー\",\"OK\")","v":"OK"},{"$f":"IF(O47<0,\"エラー\",\"OK\")","v":"OK"},{"$f":"IF(AND(E47<=E28,G47<=G28,I47<=I28,J47<=J28,K47<=K28,L47<=L28,M47<=M28,N47<=N28),\"OK\",\"エラー\")","v":"OK"}]
[null,"一般課程",null,{"$f":"IF(D29=\"\",\"\",D29)","v":""},null,{"$f":"E48-G48","v":0},null,{"$f":"SUM(I48:N48)","v":0},null,null,null,null,null,null,{"$f":"G48-H48","v":0},null,null,null,{"$f":"IF(COUNTA(G48,I48:N48)>=1,IF(E48<=0,\"エラー\",\"OK\"),\"OK\")","v":"OK"},{"$f":"IF(F48<0,\"エラー\",\"OK\")","v":"OK"},{"$f":"IF(O48<0,\"エラー\",\"OK\")","v":"OK"},{"$f":"IF(AND(E48<=E29,G48<=G29,I48<=I29,J48<=J29,K48<=K29,L48<=L29,M48<=M29,N48<=N29),\"OK\",\"エラー\")","v":"OK"}]
[null,"小　計",null,null,{"$f":"SUM(E46:E48)","v":0},{"$f":"SUM(F46:F48)","v":0},{"$f":"SUM(G46:G48)","v":0},0,0,0,0,0,0,0,0]
[]
[]
[null,null,null,null,null,null,null,"「改修予定有」の棟に関して、改修予定時期について入力"]
[null,null,null,null,null,null,null,"（２棟以上の棟がある場合は、そのうち直近の時期について入力）"]
[null,null,null,null,null,null,null,null,null,"【Is値0.3未満】",null,"【Is値0.3以上0.6未満】"]
[null,null,null,null,null,null,null,null,"専門課程"]
[null,null,null,null,null,null,null,null,"高等課程"]
[null,null,null,null,null,null,null,null,"一般課程"]
[]
[null,"【B表】面積で入力（A表に回答した建物の面積について記載すること）",null,null,null,null,null,null,null,null,null,null,null,"(単位：㎡）"]
[null,null,null,"生徒数が一番多い課程","全保有面積","昭和57年以降建築の面積\n（A-C）","昭和56年以前建築の面積",null,null,null,null,null,null,null,null,null,null,"確認用チェック欄"]
[null,null,null,null,null,null,"昭和56年以前建築の面積","耐震診断実施の面積",null,null,null,null,null,null,"耐震診断未実施の面積\n（C-D）",null,null,"「生徒数が一番多い課程」は「○」が一つ選択されているか","「全保有面積」は記入されているか","「昭和57年以降建築の面積」がマイナスになっていないか","「耐震診断未実施の面積」がマイナスになっていないか","「棟数」を回答した欄に回答しているか"]
[null,null,null,null,null,null,null,null,"耐震化済の面積（Ｉｓ値0.6以上）",null,"改修予定有の面積（Ｉｓ値0.6未満）",null,"改修予定無の面積（Ｉｓ値0.6未満）"]
[null,null,null,null,null,null,null,"（E～Lの計）","改修の必要がない棟の面積","改修済の棟の面積","0.3未満","0.3以上0.6未満","0.3未満","0.3以上0.6未満"]
[null,null,null,null,"A","B","C","D","E","F","G","H","I","J","K"]
[null,"専門課程",null,{"$f":"IF(D27=\"\",\"\",D27)","v":""},null,{"$f":"E65- G65","v":0},null,{"$f":"SUM(I65:N65)","v":0},null,null,null,null,null,null,{"$f":"+G65-H65","v":0},null,null,{"$f":"IF(COUNTA(E65:E67,G65:G67,I65:N67)=0,\"OK\",IF(COUNTIF(D65:D67,\"○\")=1,\"OK\",\"エラー\"))","v":"OK"},{"$f":"IF(COUNTA(G65,I65:N65)>=1,IF(E65<=0,\"エラー\",\"OK\"),\"OK\")","v":"OK"},{"$f":"IF(F65<0,\"エラー\",\"OK\")","v":"OK"},{"$f":"IF(O65<0,\"エラー\",\"OK\")","v":"OK"},{"$f":"IF(AND(COUNTA(E27)=COUNTA(E65),COUNTA(G27)=COUNTA(G65),COUNTA(I27)=COUNTA(I65),COUNTA(J27)=COUNTA(J65),COUNTA(K27)=COUNTA(K65),COUNTA(L27)=COUNTA(L65),COUNTA(M27)=COUNTA(M65),COUNTA(N27)=COUNTA(N65)),\"OK\",\"エラー\")","v":"OK"}]
[null,"高等課程",null,{"$f":"IF(D28=\"\",\"\",D28)","v":""},null,{"$f":"E66- G66","v":0},null,{"$f":"SUM(I66:N66)","v":0},null,null,null,null,null,null,{"$f":"+G66-H66","v":0},null,null,null,{"$f":"IF(COUNTA(G66,I66:N66)>=1,IF(E66<=0,\"エラー\",\"OK\"),\"OK\")","v":"OK"},{"$f":"IF(F66<0,\"エラー\",\"OK\")","v":"OK"},{"$f":"IF(O66<0,\"エラー\",\"OK\")","v":"OK"},{"$f":"IF(AND(COUNTA(E28)=COUNTA(E66),COUNTA(G28)=COUNTA(G66),COUNTA(I28)=COUNTA(I66),COUNTA(J28)=COUNTA(J66),COUNTA(K28)=COUNTA(K66),COUNTA(L28)=COUNTA(L66),COUNTA(M28)=COUNTA(M66),COUNTA(N28)=COUNTA(N66)),\"OK\",\"エラー\")","v":"OK"}]
[null,"一般課程",null,{"$f":"IF(D29=\"\",\"\",D29)","v":""},null,{"$f":"E67- G67","v":0},null,{"$f":"SUM(I67:N67)","v":0},null,null,null,null,null,null,{"$f":"+G67-H67","v":0},null,null,null,{"$f":"IF(COUNTA(G67,I67:N67)>=1,IF(E67<=0,\"エラー\",\"OK\"),\"OK\")","v":"OK"},{"$f":"IF(F67<0,\"エラー\",\"OK\")","v":"OK"},{"$f":"IF(O67<0,\"エラー\",\"OK\")","v":"OK"},{"$f":"IF(AND(COUNTA(E29)=COUNTA(E67),COUNTA(G29)=COUNTA(G67),COUNTA(I29)=COUNTA(I67),COUNTA(J29)=COUNTA(J67),COUNTA(K29)=COUNTA(K67),COUNTA(L29)=COUNTA(L67),COUNTA(M29)=COUNTA(M67),COUNTA(N29)=COUNTA(N67)),\"OK\",\"エラー\")","v":"OK"}]
[null,"小　計",null,null,{"$f":"SUM(E65:E67)","v":0},0,0,0,0,0,0,0,0,0,0]
[null,"※　小数第３位の値は四捨五入され、小数第２位までの表示となる。"]
[]
[null,"【b表】上記表（B表）へ回答した建物のうち、2階建て以上又は延べ床面積が200㎡以上の建物（非木造のものに限る）の数を下記表へ入力すること。"]
[null,"（a表に回答した建物の面積について記載すること）",null,null,null,null,null,null,null,null,null,null,null,"(単位：㎡）"]
[null,null,null,"生徒数が一番多い課程","全保有面積","昭和57年以降建築の面積\n（A-C）","昭和56年以前建築の面積",null,null,null,null,null,null,null,null,null,null,"確認用チェック欄"]
[null,null,null,null,null,null,"昭和56年以前建築の面積","耐震診断実施の面積",null,null,null,null,null,null,"耐震診断未実施の面積\n（C-D）",null,null,"「生徒数が一番多い課程」は「○」が一つ選択されているか","「全保有面積」は記入されているか","「昭和57年以降建築の面積」がマイナスになっていないか","「耐震診断未実施の面積」がマイナスになっていないか","「棟数」を回答した欄に回答しているか","上記表を上回る棟数を入力している箇所がないか"]
[null,null,null,null,null,null,null,null,"耐震化済の面積（Ｉｓ値0.6以上）",null,"改修予定有の面積（Ｉｓ値0.6未満）",null,"改修予定無の面積（Ｉｓ値0.6未満）"]
[null,null,null,null,null,null,null,"（E～Lの計）","改修の必要がない棟の面積","改修済の棟の面積","0.3未満","0.3以上0.6未満","0.3未満","0.3以上0.6未満"]
[null,null,null,null,"A","B","C","D","E","F","G","H","I","J","K"]
[null,"専門課程",null,{"$f":"IF(D46=\"\",\"\",D46)","v":""},null,{"$f":"E78- G78","v":0},null,{"$f":"SUM(I78:N78)","v":0},null,null,null,null,null,null,{"$f":"+G78-H78","v":0},null,null,{"$f":"IF(COUNTA(E78:E80,G78:G80,I78:N80)=0,\"OK\",IF(COUNTIF(D78:D80,\"○\")=1,\"OK\",\"エラー\"))","v":"OK"},{"$f":"IF(COUNTA(G78,I78:N78)>=1,IF(E78<=0,\"エラー\",\"OK\"),\"OK\")","v":"OK"},{"$f":"IF(F78<0,\"エラー\",\"OK\")","v":"OK"},{"$f":"IF(O78<0,\"エラー\",\"OK\")","v":"OK"},{"$f":"IF(AND(COUNTA(E46)=COUNTA(E78),COUNTA(G46)=COUNTA(G78),COUNTA(I46)=COUNTA(I78),COUNTA(J46)=COUNTA(J78),COUNTA(K46)=COUNTA(K78),COUNTA(L46)=COUNTA(L78),COUNTA(M46)=COUNTA(M78),COUNTA(N46)=COUNTA(N78)),\"OK\",\"エラー\")","v":"OK"},{"$f":"IF(AND(E78<=E65,G78<=G65,I78<=I65,J78<=J65,K78<=K65,L78<=L65,M78<=M65,N78<=N65),\"OK\",\"エラー\")","v":"OK"}]
[null,"高等課程",null,{"$f":"IF(D47=\"\",\"\",D47)","v":""},null,{"$f":"E79- G79","v":0},null,{"$f":"SUM(I79:N79)","v":0},null,null,null,null,null,null,{"$f":"+G79-H79","v":0},null,null,null,{"$f":"IF(COUNTA(G79,I79:N79)>=1,IF(E79<=0,\"エラー\",\"OK\"),\"OK\")","v":"OK"},{"$f":"IF(F79<0,\"エラー\",\"OK\")","v":"OK"},{"$f":"IF(O79<0,\"エラー\",\"OK\")","v":"OK"},{"$f":"IF(AND(COUNTA(E47)=COUNTA(E79),COUNTA(G47)=COUNTA(G79),COUNTA(I47)=COUNTA(I79),COUNTA(J47)=COUNTA(J79),COUNTA(K47)=COUNTA(K79),COUNTA(L47)=COUNTA(L79),COUNTA(M47)=COUNTA(M79),COUNTA(N47)=COUNTA(N79)),\"OK\",\"エラー\")","v":"OK"},{"$f":"IF(AND(E79<=E66,G79<=G66,I79<=I66,J79<=J66,K79<=K66,L79<=L66,M79<=M66,N79<=N66),\"OK\",\"エラー\")","v":"OK"}]
[null,"一般課程",null,{"$f":"IF(D48=\"\",\"\",D48)","v":""},null,{"$f":"E80- G80","v":0},null,{"$f":"SUM(I80:N80)","v":0},null,null,null,null,null,null,{"$f":"+G80-H80","v":0},null,null,null,{"$f":"IF(COUNTA(G80,I80:N80)>=1,IF(E80<=0,\"エラー\",\"OK\"),\"OK\")","v":"OK"},{"$f":"IF(F80<0,\"エラー\",\"OK\")","v":"OK"},{"$f":"IF(O80<0,\"エラー\",\"OK\")","v":"OK"},{"$f":"IF(AND(COUNTA(E48)=COUNTA(E80),COUNTA(G48)=COUNTA(G80),COUNTA(I48)=COUNTA(I80),COUNTA(J48)=COUNTA(J80),COUNTA(K48)=COUNTA(K80),COUNTA(L48)=COUNTA(L80),COUNTA(M48)=COUNTA(M80),COUNTA(N48)=COUNTA(N80)),\"OK\",\"エラー\")","v":"OK"},{"$f":"IF(AND(E80<=E67,G80<=G67,I80<=I67,J80<=J67,K80<=K67,L80<=L67,M80<=M67,N80<=N67),\"OK\",\"エラー\")","v":"OK"}]
[null,"小　計",null,null,{"$f":"SUM(E78:E80)","v":0},0,0,0,0,0,0,0,0,0,0]
[null,"※　小数第３位の値は四捨五入され、小数第２位までの表示となる。"]
[]
[null,"【避難所指定を受けていない学校】"]
[null,"【C表】棟数で入力",null,null,null,null,null,null,null,null,null,null,null,"(単位：棟）"]
[null,null,null,"生徒数が一番多い課程","全棟数","昭和57年以降の建築棟数\n（A-C）","昭和56年以前建築の棟数",null,null,null,null,null,null,null,null,null,null,"確認用チェック欄"]
[null,null,null,null,null,null,"昭和56年以前建築の棟数","耐震診断実施の棟数",null,null,null,null,null,null,"耐震診断未実施の棟数\n（C-D）",null,null,"「生徒数が一番多い課程」は「○」が一つ選択されているか","「全棟数」は記入されているか","「昭和57年以降の建築棟数」がマイナスになっていないか","「耐震診断未実施の棟数」がマイナスになっていないか"]
[null,null,null,null,null,null,null,null,"耐震化済の棟数（Ｉｓ値0.6以上）",null,"改修予定有の棟数（Ｉｓ値0.6未満）",null,"改修予定無の棟数（Ｉｓ値0.6未満）"]
[null,null,null,null,null,null,null,"（E～Lの計）","改修の必要がない棟数","改修済の棟数","0.3未満","0.3以上0.6未満","0.3未満","0.3以上0.6未満"]
[null,null,null,null,"A","B","C","D","E","F","G","H","I","J","K"]
[null,"専門課程",null,null,null,{"$f":"E91-G91","v":0},null,{"$f":"SUM(I91:N91)","v":0},null,null,null,null,null,null,{"$f":"G91-H91","v":0},null,null,{"$f":"IF(COUNTA(E91:E93,G91:G93,I91:N93)=0,\"OK\",IF(COUNTIF(D91:D93,\"○\")=1,\"OK\",\"エラー\"))","v":"OK"},{"$f":"IF(COUNTA(G91,I91:N91)>=1,IF(E91<=0,\"エラー\",\"OK\"),\"OK\")","v":"OK"},{"$f":"IF(F91<0,\"エラー\",\"OK\")","v":"OK"},{"$f":"IF(O91<0,\"エラー\",\"OK\")","v":"OK"}]
[null,"高等課程",null,null,null,{"$f":"E92-G92","v":0},null,{"$f":"SUM(I92:N92)","v":0},null,null,null,null,null,null,{"$f":"G92-H92","v":0},null,null,null,{"$f":"IF(COUNTA(G92,I92:N92)>=1,IF(E92<=0,\"エラー\",\"OK\"),\"OK\")","v":"OK"},{"$f":"IF(F92<0,\"エラー\",\"OK\")","v":"OK"},{"$f":"IF(O92<0,\"エラー\",\"OK\")","v":"OK"}]
[null,"一般課程",null,null,null,{"$f":"E93-G93","v":0},null,{"$f":"SUM(I93:N93)","v":0},null,null,null,null,null,null,{"$f":"G93-H93","v":0},null,null,null,{"$f":"IF(COUNTA(G93,I93:N93)>=1,IF(E93<=0,\"エラー\",\"OK\"),\"OK\")","v":"OK"},{"$f":"IF(F93<0,\"エラー\",\"OK\")","v":"OK"},{"$f":"IF(O93<0,\"エラー\",\"OK\")","v":"OK"}]
[null,"小　計",null,null,{"$f":"SUM(E91:E93)","v":0},{"$f":"SUM(F91:F93)","v":0},{"$f":"SUM(G91:G93)","v":0},0,0,0,0,0,0,0,0]
[]
[]
[null,null,null,null,null,null,null,"「改修予定有」の棟に関して、改修予定時期について入力"]
[null,null,null,null,null,null,null,"（２棟以上の棟がある場合は、そのうち直近の時期について入力）"]
[null,null,null,null,null,null,null,null,null,"【Is値0.3未満】",null,"【Is値0.3以上0.6未満】"]
[null,null,null,null,null,null,null,null,"専門課程"]
[null,null,null,null,null,null,null,null,"高等課程"]
[null,null,null,null,null,null,null,null,"一般課程"]
[]
[null,"【c表】上記表（C表）へ回答した建物のうち、2階建て以上又は延べ床面積が200㎡以上の建物（非木造のものに限る）の数を下記表へ入力すること。",null,null,null,null,null,null,null,null,null,null,null,null,"(単位：棟）"]
[null,null,null,"生徒数が一番多い課程","全棟数","昭和57年以降の建築棟数\n（A-C）","昭和56年以前建築の棟数",null,null,null,null,null,null,null,null,null,null,"確認用チェック欄"]
[null,null,null,null,null,null,"昭和56年以前建築の棟数","耐震診断実施の棟数",null,null,null,null,null,null,"耐震診断未実施の棟数\n（C-D）",null,null,"「生徒数が一番多い課程」は「○」が一つ選択されているか","「全棟数」は記入されているか","「昭和57年以降の建築棟数」がマイナスになっていないか","「耐震診断未実施の棟数」がマイナスになっていないか","上記表を上回る棟数を入力している箇所がないか"]
[null,null,null,null,null,null,null,null,"耐震化済の棟数（Ｉｓ値0.6以上）",null,"改修予定有の棟数（Ｉｓ値0.6未満）",null,"改修予定無の棟数（Ｉｓ値0.6未満）"]
[null,null,null,null,null,null,null,"（E～Lの計）","改修の必要がない棟数","改修済の棟数","0.3未満","0.3以上0.6未満","0.3未満","0.3以上0.6未満"]
[null,null,null,null,"A","B","C","D","E","F","G","H","I","J","K"]
[null,"専門課程",null,{"$f":"IF(D91=\"\",\"\",D91)","v":""},null,{"$f":"E110-G110","v":0},null,{"$f":"SUM(I110:N110)","v":0},null,null,null,null,null,null,{"$f":"G110-H110","v":0},null,null,{"$f":"IF(COUNTA(E110:E112,G110:G112,I110:N112)=0,\"OK\",IF(COUNTIF(D110:D112,\"○\")=1,\"OK\",\"エラー\"))","v":"OK"},{"$f":"IF(COUNTA(G110,I110:N110)>=1,IF(E110<=0,\"エラー\",\"OK\"),\"OK\")","v":"OK"},{"$f":"IF(F110<0,\"エラー\",\"OK\")","v":"OK"},{"$f":"IF(O110<0,\"エラー\",\"OK\")","v":"OK"},{"$f":"IF(AND(E110<=E91,G110<=G91,I110<=I91,J110<=J91,K110<=K91,L110<=L91,M110<=M91,N110<=N91),\"OK\",\"エラー\")","v":"OK"}]
[null,"高等課程",null,{"$f":"IF(D92=\"\",\"\",D92)","v":""},null,{"$f":"E111-G111","v":0},null,{"$f":"SUM(I111:N111)","v":0},null,null,null,null,null,null,{"$f":"G111-H111","v":0},null,null,null,{"$f":"IF(COUNTA(G111,I111:N111)>=1,IF(E111<=0,\"エラー\",\"OK\"),\"OK\")","v":"OK"},{"$f":"IF(F111<0,\"エラー\",\"OK\")","v":"OK"},{"$f":"IF(O111<0,\"エラー\",\"OK\")","v":"OK"},{"$f":"IF(AND(E111<=E92,G111<=G92,I111<=I92,J111<=J92,K111<=K92,L111<=L92,M111<=M92,N111<=N92),\"OK\",\"エラー\")","v":"OK"}]
[null,"一般課程",null,{"$f":"IF(D93=\"\",\"\",D93)","v":""},null,{"$f":"E112-G112","v":0},null,{"$f":"SUM(I112:N112)","v":0},null,null,null,null,null,null,{"$f":"G112-H112","v":0},null,null,null,{"$f":"IF(COUNTA(G112,I112:N112)>=1,IF(E112<=0,\"エラー\",\"OK\"),\"OK\")","v":"OK"},{"$f":"IF(F112<0,\"エラー\",\"OK\")","v":"OK"},{"$f":"IF(O112<0,\"エラー\",\"OK\")","v":"OK"},{"$f":"IF(AND(E112<=E93,G112<=G93,I112<=I93,J112<=J93,K112<=K93,L112<=L93,M112<=M93,N112<=N93),\"OK\",\"エラー\")","v":"OK"}]
[null,"小　計",null,null,{"$f":"SUM(E110:E112)","v":0},{"$f":"SUM(F110:F112)","v":0},{"$f":"SUM(G110:G112)","v":0},0,0,0,0,0,0,0,0]
[]
[]
[null,null,null,null,null,null,null,"「改修予定有」の棟に関して、改修予定時期について入力"]
[null,null,null,null,null,null,null,"（２棟以上の棟がある場合は、そのうち直近の時期について入力）"]
[null,null,null,null,null,null,null,null,null,"【Is値0.3未満】",null,"【Is値0.3以上0.6未満】"]
[null,null,null,null,null,null,null,null,"専門課程"]
[null,null,null,null,null,null,null,null,"高等課程"]
[null,null,null,null,null,null,null,null,"一般課程"]
[]
[null,"【D表】面積で入力（C表で回答した建物の面積について記載すること）",null,null,null,null,null,null,null,null,null,null,null,"(単位：㎡）"]
[null,null,null,"生徒数が一番多い課程","全保有面積","昭和57年以降建築の面積\n（A-C）","昭和56年以前建築の面積",null,null,null,null,null,null,null,null,null,null,"確認用チェック欄"]
[null,null,null,null,null,null,"昭和56年以前建築の面積","耐震診断実施の面積",null,null,null,null,null,null,"耐震診断未実施の面積\n（C-D）",null,null,"「生徒数が一番多い課程」は「○」が一つ選択されているか","「全保有面積」は記入されているか","「昭和57年以降建築の面積」がマイナスになっていないか","「耐震診断未実施の面積」がマイナスになっていないか","「棟数」を回答した欄に回答しているか"]
[null,null,null,null,null,null,null,null,"耐震化済の面積（Ｉｓ値0.6以上）",null,"改修予定有の面積（Ｉｓ値0.6未満）",null,"改修予定無の面積（Ｉｓ値0.6未満）"]
[null,null,null,null,null,null,null,"（E～Lの計）","改修の必要がない棟の面積","改修済の棟の面積","0.3未満","0.3以上0.6未満","0.3未満","0.3以上0.6未満"]
[null,null,null,null,"A","B","C","D","E","F","G","H","I","J","K"]
[null,"専門課程",null,{"$f":"IF(D91=\"\",\"\",D91)","v":""},null,{"$f":"E129- G129","v":0},null,{"$f":"SUM(I129:N129)","v":0},null,null,null,null,null,null,{"$f":"+G129-H129","v":0},null,null,{"$f":"IF(COUNTA(E129:E131,G129:G131,I129:N131)=0,\"OK\",IF(COUNTIF(D129:D131,\"○\")=1,\"OK\",\"エラー\"))","v":"OK"},{"$f":"IF(COUNTA(G129,I129:N129)>=1,IF(E129<=0,\"エラー\",\"OK\"),\"OK\")","v":"OK"},{"$f":"IF(F129<0,\"エラー\",\"OK\")","v":"OK"},{"$f":"IF(O129<0,\"エラー\",\"OK\")","v":"OK"},{"$f":"IF(AND(COUNTA(E91)=COUNTA(E129),COUNTA(G91)=COUNTA(G129),COUNTA(I91)=COUNTA(I129),COUNTA(J91)=COUNTA(J129),COUNTA(K91)=COUNTA(K129),COUNTA(L91)=COUNTA(L129),COUNTA(M91)=COUNTA(M129),COUNTA(N91)=COUNTA(N129)),\"OK\",\"エラー\")","v":"OK"}]
[null,"高等課程",null,{"$f":"IF(D92=\"\",\"\",D92)","v":""},null,{"$f":"E130- G130","v":0},null,{"$f":"SUM(I130:N130)","v":0},null,null,null,null,null,null,{"$f":"+G130-H130","v":0},null,null,null,{"$f":"IF(COUNTA(G130,I130:N130)>=1,IF(E130<=0,\"エラー\",\"OK\"),\"OK\")","v":"OK"},{"$f":"IF(F130<0,\"エラー\",\"OK\")","v":"OK"},{"$f":"IF(O130<0,\"エラー\",\"OK\")","v":"OK"},{"$f":"IF(AND(COUNTA(E92)=COUNTA(E130),COUNTA(G92)=COUNTA(G130),COUNTA(I92)=COUNTA(I130),COUNTA(J92)=COUNTA(J130),COUNTA(K92)=COUNTA(K130),COUNTA(L92)=COUNTA(L130),COUNTA(M92)=COUNTA(M130),COUNTA(N92)=COUNTA(N130)),\"OK\",\"エラー\")","v":"OK"}]
[null,"一般課程",null,{"$f":"IF(D93=\"\",\"\",D93)","v":""},null,{"$f":"E131- G131","v":0},null,{"$f":"SUM(I131:N131)","v":0},null,null,null,null,null,null,{"$f":"+G131-H131","v":0},null,null,null,{"$f":"IF(COUNTA(G131,I131:N131)>=1,IF(E131<=0,\"エラー\",\"OK\"),\"OK\")","v":"OK"},{"$f":"IF(F131<0,\"エラー\",\"OK\")","v":"OK"},{"$f":"IF(O131<0,\"エラー\",\"OK\")","v":"OK"},{"$f":"IF(AND(COUNTA(E93)=COUNTA(E131),COUNTA(G93)=COUNTA(G131),COUNTA(I93)=COUNTA(I131),COUNTA(J93)=COUNTA(J131),COUNTA(K93)=COUNTA(K131),COUNTA(L93)=COUNTA(L131),COUNTA(M93)=COUNTA(M131),COUNTA(N93)=COUNTA(N131)),\"OK\",\"エラー\")","v":"OK"}]
[null,"小　計",null,null,{"$f":"SUM(E129:E131)","v":0},0,0,0,0,0,0,0,0,0,0]
[null,"※　小数第３位の値は四捨五入され、小数第２位までの表示となる。"]
[]
[null,"【d表】上記表（D表）へ回答した建物のうち、2階建て以上又は延べ床面積が200㎡以上の建物（非木造のものに限る）の数を下記表へ入力すること。"]
[null,"（c表に回答した建物の面積について記載すること）",null,null,null,null,null,null,null,null,null,null,null,null,"(単位：㎡）"]
[null,null,null,"生徒数が一番多い課程","全保有面積","昭和57年以降建築の面積\n（A-C）","昭和56年以前建築の面積",null,null,null,null,null,null,null,null,null,null,"確認用チェック欄"]
[null,null,null,null,null,null,"昭和56年以前建築の面積","耐震診断実施の面積",null,null,null,null,null,null,"耐震診断未実施の面積\n（C-D）",null,null,"「生徒数が一番多い課程」は「○」が一つ選択されているか","「全保有面積」は記入されているか","「昭和57年以降建築の面積」がマイナスになっていないか","「耐震診断未実施の面積」がマイナスになっていないか","「棟数」を回答した欄に回答しているか","上記表を上回る棟数を入力している箇所がないか"]
[null,null,null,null,null,null,null,null,"耐震化済の面積（Ｉｓ値0.6以上）",null,"改修予定有の面積（Ｉｓ値0.6未満）",null,"改修予定無の面積（Ｉｓ値0.6未満）"]
[null,null,null,null,null,null,null,"（E～Lの計）","改修の必要がない棟の面積","改修済の棟の面積","0.3未満","0.3以上0.6未満","0.3未満","0.3以上0.6未満"]
[null,null,null,null,"A","B","C","D","E","F","G","H","I","J","K"]
[null,"専門課程",null,{"$f":"IF(D91=\"\",\"\",D91)","v":""},null,{"$f":"E142- G142","v":0},null,{"$f":"SUM(I142:N142)","v":0},null,null,null,null,null,null,{"$f":"+G142-H142","v":0},null,null,{"$f":"IF(COUNTA(E142:E144,G142:G144,I142:N144)=0,\"OK\",IF(COUNTIF(D142:D144,\"○\")=1,\"OK\",\"エラー\"))","v":"OK"},{"$f":"IF(COUNTA(G142,I142:N142)>=1,IF(E142<=0,\"エラー\",\"OK\"),\"OK\")","v":"OK"},{"$f":"IF(F142<0,\"エラー\",\"OK\")","v":"OK"},{"$f":"IF(O142<0,\"エラー\",\"OK\")","v":"OK"},{"$f":"IF(AND(COUNTA(E110)=COUNTA(E142),COUNTA(G110)=COUNTA(G142),COUNTA(I110)=COUNTA(I142),COUNTA(J110)=COUNTA(J142),COUNTA(K110)=COUNTA(K142),COUNTA(L110)=COUNTA(L142),COUNTA(M110)=COUNTA(M142),COUNTA(N110)=COUNTA(N142)),\"OK\",\"エラー\")","v":"OK"},{"$f":"IF(AND(E142<=E129,G142<=G129,I142<=I129,J142<=J129,K142<=K129,L142<=L129,M142<=M129,N142<=N129),\"OK\",\"エラー\")","v":"OK"}]
[null,"高等課程",null,{"$f":"IF(D92=\"\",\"\",D92)","v":""},null,{"$f":"E143- G143","v":0},null,{"$f":"SUM(I143:N143)","v":0},null,null,null,null,null,null,{"$f":"+G143-H143","v":0},null,null,null,{"$f":"IF(COUNTA(G143,I143:N143)>=1,IF(E143<=0,\"エラー\",\"OK\"),\"OK\")","v":"OK"},{"$f":"IF(F143<0,\"エラー\",\"OK\")","v":"OK"},{"$f":"IF(O143<0,\"エラー\",\"OK\")","v":"OK"},{"$f":"IF(AND(COUNTA(E111)=COUNTA(E143),COUNTA(G111)=COUNTA(G143),COUNTA(I111)=COUNTA(I143),COUNTA(J111)=COUNTA(J143),COUNTA(K111)=COUNTA(K143),COUNTA(L111)=COUNTA(L143),COUNTA(M111)=COUNTA(M143),COUNTA(N111)=COUNTA(N143)),\"OK\",\"エラー\")","v":"OK"},{"$f":"IF(AND(E143<=E130,G143<=G130,I143<=I130,J143<=J130,K143<=K130,L143<=L130,M143<=M130,N143<=N130),\"OK\",\"エラー\")","v":"OK"}]
[null,"一般課程",null,{"$f":"IF(D93=\"\",\"\",D93)","v":""},null,{"$f":"E144- G144","v":0},null,{"$f":"SUM(I144:N144)","v":0},null,null,null,null,null,null,{"$f":"+G144-H144","v":0},null,null,null,{"$f":"IF(COUNTA(G144,I144:N144)>=1,IF(E144<=0,\"エラー\",\"OK\"),\"OK\")","v":"OK"},{"$f":"IF(F144<0,\"エラー\",\"OK\")","v":"OK"},{"$f":"IF(O144<0,\"エラー\",\"OK\")","v":"OK"},{"$f":"IF(AND(COUNTA(E112)=COUNTA(E144),COUNTA(G112)=COUNTA(G144),COUNTA(I112)=COUNTA(I144),COUNTA(J112)=COUNTA(J144),COUNTA(K112)=COUNTA(K144),COUNTA(L112)=COUNTA(L144),COUNTA(M112)=COUNTA(M144),COUNTA(N112)=COUNTA(N144)),\"OK\",\"エラー\")","v":"OK"},{"$f":"IF(AND(E144<=E131,G144<=G131,I144<=I131,J144<=J131,K144<=K131,L144<=L131,M144<=M131,N144<=N131),\"OK\",\"エラー\")","v":"OK"}]
[null,"小　計",null,null,{"$f":"SUM(E142:E144)","v":0},0,0,0,0,0,0,0,0,0,0]
[null,"※　小数第３位の値は四捨五入され、小数第２位までの表示となる。",null,null,null,null,null,null,null,null,null,null,null,null,1]
[]
[null,"合計（全棟数）"]
[null,null,null,"生徒数が一番多い課程","全棟数","昭和57年以降の建築棟数\n（A-C）","昭和56年以前建築の棟数",null,null,null,null,null,null,null,null,"耐震化率\n（％）\n（B＋E＋F）/A"]
[null,null,null,null,null,null,"昭和56年以前建築の棟数","耐震診断実施の棟数",null,null,null,null,null,null,"耐震診断未実施の棟数\n（C-D）"]
[null,null,null,null,null,null,null,null,"耐震化済の棟数（Ｉｓ値0.6以上）",null,"改修予定有の棟数（Ｉｓ値0.6未満）",null,"改修予定無の棟数（Ｉｓ値0.6未満）"]
[null,null,null,null,null,null,null,"（E～Lの計）","改修の必要がない棟数","改修済の棟数","0.3未満","0.3以上0.6未満","0.3未満","0.3以上0.6未満"]
[null,null,null,null,"A","B","C","D","E","F","G","H","I","J","K","L"]
[null,"専門課程",null,{"$f":"D91&D27","v":""},{"$f":"SUM(E27,E91)","v":0},{"$f":"E154-G154","v":0},{"$f":"SUM(G27,G91)","v":0},{"$f":"SUM(I154:N154)","v":0},{"$f":"SUM(I27,I91)","v":0},0,0,0,0,0,{"$f":"G154-H154","v":0},{"$f":"(F154+I154+J154)/E154","v":{"$error":"#DIV/0!"}}]
[null,"高等課程",null,{"$f":"D92&D28","v":""},{"$f":"SUM(E28,E92)","v":0},{"$f":"E155-G155","v":0},{"$f":"SUM(G28,G92)","v":0},{"$f":"SUM(I155:N155)","v":0},0,0,0,0,0,0,{"$f":"G155-H155","v":0},{"$f":"(F155+I155+J155)/E155","v":{"$error":"#DIV/0!"}}]
[null,"一般課程",null,{"$f":"D93&D29","v":""},{"$f":"SUM(E29,E93)","v":0},{"$f":"E156-G156","v":0},{"$f":"SUM(G29,G93)","v":0},{"$f":"SUM(I156:N156)","v":0},0,0,0,0,0,0,{"$f":"G156-H156","v":0},{"$f":"(F156+I156+J156)/E156","v":{"$error":"#DIV/0!"}}]
[null,"小　計",null,null,{"$f":"SUM(E154:E156)","v":0},{"$f":"SUM(F154:F156)","v":0},{"$f":"SUM(G154:G156)","v":0},0,0,0,0,0,0,0,{"$f":"SUM(O154:O156)","v":0},{"$f":"(F157+I157+J157)/E157","v":{"$error":"#DIV/0!"}}]
[]
[null,"合計（200㎡以上棟数）"]
[null,null,null,"生徒数が一番多い課程","全棟数","昭和57年以降の建築棟数\n（A-C）","昭和56年以前建築の棟数",null,null,null,null,null,null,null,null,"耐震化率\n（％）\n（B＋E＋F）/A"]
[null,null,null,null,null,null,"昭和56年以前建築の棟数","耐震診断実施の棟数",null,null,null,null,null,null,"耐震診断未実施の棟数\n（C-D）"]
[null,null,null,null,null,null,null,null,"耐震化済の棟数（Ｉｓ値0.6以上）",null,"改修予定有の棟数（Ｉｓ値0.6未満）",null,"改修予定無の棟数（Ｉｓ値0.6未満）"]
[null,null,null,null,null,null,null,"（E～Lの計）","改修の必要がない棟数","改修済の棟数","0.3未満","0.3以上0.6未満","0.3未満","0.3以上0.6未満"]
[null,null,null,null,"A","B","C","D","E","F","G","H","I","J","K","L"]
[null,"専門課程",null,{"$f":"D110&D46","v":""},{"$f":"SUM(E46,E110)","v":0},{"$f":"E165-G165","v":0},{"$f":"SUM(G46,G110)","v":0},{"$f":"SUM(I165:N165)","v":0},{"$f":"SUM(I46,I110)","v":0},0,0,0,0,0,{"$f":"G165-H165","v":0},{"$f":"(F165+I165+J165)/E165","v":{"$error":"#DIV/0!"}}]
[null,"高等課程",null,{"$f":"D111&D47","v":""},{"$f":"SUM(E47,E111)","v":0},{"$f":"E166-G166","v":0},{"$f":"SUM(G47,G111)","v":0},{"$f":"SUM(I166:N166)","v":0},0,0,0,0,0,0,{"$f":"G166-H166","v":0},{"$f":"(F166+I166+J166)/E166","v":{"$error":"#DIV/0!"}}]
[null,"一般課程",null,{"$f":"D112&D48","v":""},{"$f":"SUM(E48,E112)","v":0},{"$f":"E167-G167","v":0},{"$f":"SUM(G48,G112)","v":0},{"$f":"SUM(I167:N167)","v":0},0,0,0,0,0,0,{"$f":"G167-H167","v":0},{"$f":"(F167+I167+J167)/E167","v":{"$error":"#DIV/0!"}}]
[null,"小　計",null,null,{"$f":"SUM(E165:E167)","v":0},{"$f":"SUM(F165:F167)","v":0},{"$f":"SUM(G165:G167)","v":0},0,0,0,0,0,0,0,0,{"$f":"(F168+I168+J168)/E168","v":{"$error":"#DIV/0!"}}]
[]
[null,"○学校数で入力・・・１（学校ごとに避難所指定がされていた場合（片方の表のみ回答））",null,null,null,null,null,null,null,null,"(単位：学校数）"]
[null,null,null,"生徒数が一番多い課程","学校数","昭和57年以降建築\n（A-C）",null,"昭和56年以前建築",null,null,null,"耐震化率\n（％）\n（B＋E＋F）/A"]
[null,null,null,null,null,null,"昭和56年以前建築","耐震診断実施済",null,null,"耐震診断未実施\n（C-D）"]
[null,null,null,null,null,null,null,"全ての建物が新耐震基準に適合している","うち、新耐震基準に適合しない建物があり、全て耐震改修済み","うち新耐震基準に適合しない建物があり、未改修の建物がある学校数"]
[]
[null,null,null,null,"A","B","C","D","E","F","G"]
[null,"専門課程",null,{"$f":"D154","v":""},{"$f":"COUNTIF(D176,\"○\")","v":0},{"$f":"IF(AND(E176>=1,G154=0),1,0)","v":0},{"$f":"IF(AND(E176>=1,G154>=1),1,0)","v":0},{"$f":"IF(AND(E176>=1,I154>=1,J154+K154+L154+M154+N154=0,O154=0),1,0)","v":0},{"$f":"IF(AND(E176>=1,J154>=1,K154+L154+M154+N154=0,O154=0),1,0)","v":0},{"$f":"IF(AND(G176>=1,K154+L154+M154+N154>=1,O154=0),1,0)","v":0},{"$f":"IF(AND(E176>=1,O154>=1),\"○\",\"-\")","v":"-"},{"$f":"(F179+H179+I179)/E179","v":{"$error":"#DIV/0!"}}]
[null,"高等課程",null,{"$f":"D155","v":""},{"$f":"COUNTIF(D177,\"○\")","v":0},{"$f":"IF(AND(E177>=1,G155=0),1,0)","v":0},{"$f":"IF(AND(E177>=1,G155>=1),1,0)","v":0},{"$f":"IF(AND(E177>=1,I155>=1,J155+K155+L155+M155+N155=0,O155=0),1,0)","v":0},{"$f":"IF(AND(E177>=1,J155>=1,K155+L155+M155+N155=0,O155=0),1,0)","v":0},{"$f":"IF(AND(G177>=1,K155+L155+M155+N155>=1,O155=0),1,0)","v":0},{"$f":"IF(AND(E177>=1,O155>=1),\"○\",\"-\")","v":"-"}]
[null,"一般課程",null,{"$f":"D156","v":""},{"$f":"COUNTIF(D178,\"○\")","v":0},{"$f":"IF(AND(E178>=1,G156=0),1,0)","v":0},{"$f":"IF(AND(E178>=1,G156>=1),1,0)","v":0},{"$f":"IF(AND(E178>=1,I156>=1,J156+K156+L156+M156+N156=0,O156=0),1,0)","v":0},{"$f":"IF(AND(E178>=1,J156>=1,K156+L156+M156+N156=0,O156=0),1,0)","v":0},{"$f":"IF(AND(G178>=1,K156+L156+M156+N156>=1,O156=0),1,0)","v":0},{"$f":"IF(AND(E178>=1,O156>=1),\"○\",\"-\")","v":"-"}]
[null,"小　計",null,null,{"$f":"SUM(E176:E178)","v":0},0,0,0,{"$f":"SUM(I176:I178)","v":0},0]
[]
[null,"○学校数で入力・・・２（建物ごとに避難所指定がされていた場合（両方の表へ回答））",null,null,null,null,null,null,null,null,"(単位：学校数）"]
[null,null,null,"生徒数が一番多い課程","学校数","昭和57年以降建築\n（A-C）",null,"昭和56年以前建築",null,null,null,"耐震化率\n（％）\n（B＋E＋F）/A"]
[null,null,null,null,null,null,"昭和56年以前建築","耐震診断実施済",null,null,"耐震診断未実施\n（C-D）"]
[null,null,null,null,null,null,null,"全ての建物が新耐震基準に適合している","うち、新耐震基準に適合しない建物があり、全て耐震改修済み","うち新耐震基準に適合しない建物があり、未改修の建物がある学校数"]
[]
[null,null,null,null,"A","B","C","D","E","F","G"]
[null,"専門課程",null,{"$f":"IF(D176=\"\",\"\",D176)","v":""},{"$f":"COUNTIF(D187,\"○○\")","v":0},{"$f":"IF(AND(E187>=1,G154=0),1,0)","v":0},{"$f":"IF(AND(E187>=1,G154>=1),1,0)","v":0},{"$f":"IF(AND(E187>=1,I154>=1,J154+K154+L154+M154+N154=0,O154=0),1,0)","v":0},{"$f":"IF(AND(E187>=1,J154>=1,K154+L154+M154+N154=0, O154=0),1,0)","v":0},{"$f":"IF(AND(E187>=1,K154+L154+M154+N154>=1,O154=0),1,0)","v":0},{"$f":"IF(AND(E187>=1,O154>=1),\"○\",\"-\")","v":"-"},{"$f":"(F190+H190+I190)/E190","v":{"$error":"#DIV/0!"}}]
[null,"高等課程",null,{"$f":"IF(D177=\"\",\"\",D177)","v":""},{"$f":"COUNTIF(D188,\"○○\")","v":0},{"$f":"IF(AND(E188>=1,G155=0),1,0)","v":0},{"$f":"IF(AND(E188>=1,G155>=1),1,0)","v":0},{"$f":"IF(AND(E188>=1,I155>=1,J155+K155+L155+M155+N155=0,O155=0),1,0)","v":0},{"$f":"IF(AND(E188>=1,J155>=1,K155+L155+M155+N155=0, O155=0),1,0)","v":0},{"$f":"IF(AND(E188>=1,K155+L155+M155+N155>=1,O155=0),1,0)","v":0},{"$f":"IF(AND(E188>=1,O155>=1),\"○\",\"-\")","v":"-"}]
[null,"一般課程",null,{"$f":"IF(D178=\"\",\"\",D178)","v":""},{"$f":"COUNTIF(D189,\"○○\")","v":0},{"$f":"IF(AND(E189>=1,G156=0),1,0)","v":0},{"$f":"IF(AND(E189>=1,G156>=1),1,0)","v":0},{"$f":"IF(AND(E189>=1,I156>=1,J156+K156+L156+M156+N156=0,O156=0),1,0)","v":0},{"$f":"IF(AND(E189>=1,J156>=1,K156+L156+M156+N156=0, O156=0),1,0)","v":0},{"$f":"IF(AND(E189>=1,K156+L156+M156+N156>=1,O156=0),1,0)","v":0},{"$f":"IF(AND(E189>=1,O156>=1),\"○\",\"-\")","v":"-"}]
[null,"小　計",null,null,{"$f":"SUM(E187:E189)","v":0},0,{"$f":"SUM(G187:G189)","v":0},0,0,0]
[]
[null,"○学校数で入力・・・３（１と２の合計）",null,null,null,null,null,null,null,null,"(単位：学校数）"]
[null,"小　計",null,null,{"$f":"E179+E190","v":0},0,0,0,0,0,{"$f":"COUNTIF(K176:K178,\"○\")+COUNTIF(K187:K189,\"○\")","v":0},{"$f":"(F193+H193+I193)/E193","v":{"$error":"#DIV/0!"}}]
[null,"合計",null,null,null,null,null,null,null,null,null,null,null,"(単位：㎡）"]
[null,null,null,"生徒数が一番多い課程","全保有面積","昭和57年以降建築の面積\n（A-C）","昭和56年以前建築の面積",null,null,null,null,null,null,null,null,"耐震化率\n（％）\n（B＋E＋F）/A"]
[null,null,null,null,null,null,"昭和56年以前建築の面積","耐震診断実施の面積",null,null,null,null,null,null,"耐震診断未実施の面積\n（C-D）"]
[null,null,null,null,null,null,null,null,"耐震化済の面積（Ｉｓ値0.6以上）",null,"改修予定有の面積（Ｉｓ値0.6未満）",null,"改修予定無の面積（Ｉｓ値0.6未満）"]
[null,null,null,null,null,null,null,"（E～Lの計）","改修の必要がない棟の面積","改修済の棟の面積","0.3未満","0.3以上0.6未満","0.3未満","0.3以上0.6未満"]
[null,null,null,null,"A","B","C","D","E","F","G","H","I","J","K","L"]
[null,"専門課程",null,{"$f":"D154","v":""},{"$f":"SUM(E65,E129)","v":0},{"$f":"E200- G200","v":0},{"$f":"SUM(G65,G129)","v":0},{"$f":"SUM(I200:N200)","v":0},{"$f":"SUM(I65,I129)","v":0},0,0,0,0,0,{"$f":"+G200-H200","v":0},{"$f":"(F200+I200+J200)/E200","v":{"$error":"#DIV/0!"}}]
[null,"高等課程",null,{"$f":"D155","v":""},{"$f":"SUM(E66,E130)","v":0},{"$f":"E201- G201","v":0},{"$f":"SUM(G66,G130)","v":0},{"$f":"SUM(I201:N201)","v":0},0,0,0,0,0,0,{"$f":"+G201-H201","v":0},{"$f":"(F201+I201+J201)/E201","v":{"$error":"#DIV/0!"}}]
[null,"一般課程",null,{"$f":"D156","v":""},{"$f":"SUM(E67,E131)","v":0},{"$f":"E202- G202","v":0},{"$f":"SUM(G67,G131)","v":0},{"$f":"SUM(I202:N202)","v":0},0,0,0,0,0,0,{"$f":"+G202-H202","v":0},{"$f":"(F202+I202+J202)/E202","v":{"$error":"#DIV/0!"}}]
[null,"小　計",null,null,{"$f":"SUM(E200:E202)","v":0},0,0,0,0,0,0,0,0,0,0,{"$f":"(F203+I203+J203)/E203","v":{"$error":"#DIV/0!"}}]
[]
[null,"合計（200㎡以上棟数）",null,null,null,null,null,null,null,null,null,null,null,"(単位：㎡）"]
[null,null,null,"生徒数が一番多い課程","全保有面積","昭和57年以降建築の面積\n（A-C）","昭和56年以前建築の面積",null,null,null,null,null,null,null,null,"耐震化率\n（％）\n（B＋E＋F）/A"]
[null,null,null,null,null,null,"昭和56年以前建築の面積","耐震診断実施の面積",null,null,null,null,null,null,"耐震診断未実施の面積\n（C-D）"]
[null,null,null,null,null,null,null,null,"耐震化済の面積（Ｉｓ値0.6以上）",null,"改修予定有の面積（Ｉｓ値0.6未満）",null,"改修予定無の面積（Ｉｓ値0.6未満）"]
[null,null,null,null,null,null,null,"（E～Lの計）","改修の必要がない棟の面積","改修済の棟の面積","0.3未満","0.3以上0.6未満","0.3未満","0.3以上0.6未満"]
[null,null,null,null,"A","B","C","D","E","F","G","H","I","J","K","L"]
[null,"専門課程",null,{"$f":"D200","v":""},{"$f":"SUM(E78,E142)","v":0},{"$f":"E211- G211","v":0},{"$f":"SUM(G78,G142)","v":0},{"$f":"SUM(I211:N211)","v":0},{"$f":"SUM(I78,I142)","v":0},0,0,0,0,0,{"$f":"+G211-H211","v":0},{"$f":"(F211+I211+J211)/E211","v":{"$error":"#DIV/0!"}}]
[null,"高等課程",null,{"$f":"D201","v":""},{"$f":"SUM(E79,E143)","v":0},{"$f":"E212- G212","v":0},{"$f":"SUM(G79,G143)","v":0},{"$f":"SUM(I212:N212)","v":0},0,0,0,0,0,0,{"$f":"+G212-H212","v":0},{"$f":"(F212+I212+J212)/E212","v":{"$error":"#DIV/0!"}}]
[null,"一般課程",null,{"$f":"D202","v":""},{"$f":"SUM(E80,E144)","v":0},{"$f":"E213- G213","v":0},{"$f":"SUM(G80,G144)","v":0},{"$f":"SUM(I213:N213)","v":0},0,0,0,0,0,0,{"$f":"+G213-H213","v":0},{"$f":"(F213+I213+J213)/E213","v":{"$error":"#DIV/0!"}}]
[null,"小　計",null,null,{"$f":"SUM(E211:E213)","v":0},0,0,0,0,0,0,0,0,0,0,{"$f":"(F214+I214+J214)/E214","v":{"$error":"#DIV/0!"}}]
[]
[]
[null,null,null,null,null,null,null,null,null,null,null,null,{"$f":"IF(COUNTIF(R22:W144,\"エラー\")=0,\"OK\",\"エラー\")","v":"OK"}]
[]
[]
[]
[null,null,null,null,null,null,null,null,null,null,null,null,{"$f":"IF(M217=\"エラー\",\"右欄外のエラー欄を確認し、エラーが出ている箇所を修正してください\",\"\")","v":""}]

{"sheet":"様式３－２－８－１","index":9,"n_rows":91,"n_cols":35,"rows_kept":91,"cut":false,"hidden":false,"merged":[[85,29,87,29],[86,4,87,4],[86,5,87,5],[86,6,87,6],[86,7,87,7],[86,8,87,8],[86,9,87,9],[86,10,87,10],[86,11,87,11],[86,12,87,12],[85,23,87,23],[85,24,87,24],[85,25,87,25],[85,26,87,26],[85,27,87,27],[85,28,87,28],[77,23,84,29],[79,4,83,4],[79,13,83,13],[79,18,83,18],[79,19,79,21],[80,5,83,5],[80,9,83,9],[80,14,83,14],[80,15,83,15],[80,17,83,17],[55,19,57,20],[42,9,43,9],[42,10,43,10],[42,11,43,11],[42,12,43,12],[42,13,43,13],[42,14,43,14],[59,19,66,22],[77,1,87,1],[77,2,87,2],[77,3,87,3],[77,4,78,17],[77,18,78,21],[80,19,85,19],[80,21,85,21],[83,20,85,20],[86,13,87,13],[86,14,87,14],[86,15,87,15],[86,16,87,16],[86,17,87,17],[86,18,87,18],[87,19,87,21],[41,29,43,29],[41,30,43,30],[41,31,43,31],[41,32,43,32],[41,33,43,33],[42,4,43,4],[42,5,43,5],[42,6,43,6],[42,7,43,7],[42,8,43,8],[41,23,43,23],[41,24,43,24],[41,25,43,25],[41,26,43,26],[41,27,43,27],[41,28,43,28],[42,15,43,15],[42,16,43,16],[42,17,43,17],[42,18,43,18],[43,19,43,21],[33,23,40,33],[35,4,39,4],[35,13,39,13],[35,18,39,18],[35,19,35,21],[36,5,39,5],[36,9,39,9],[36,14,39,14],[36,15,39,15],[36,17,39,17],[30,1,30,21],[32,1,32,2],[33,1,43,1],[33,2,43,2],[33,3,43,3],[33,4,34,17],[33,18,34,21],[36,19,41,19],[36,21,41,21],[39,20,41,20],[28,4,28,17],[23,9,24,9],[23,10,24,10],[23,11,24,11],[23,12,24,12],[23,13,24,13],[23,14,24,14],[23,16,24,16],[23,15,24,15],[22,33,24,33],[23,4,24,4],[23,5,24,5],[23,6,24,6],[23,7,24,7],[23,8,24,8],[22,23,24,23],[22,24,24,24],[22,29,24,29],[22,26,24,26],[22,30,24,30],[22,31,24,31],[22,32,24,32],[22,27,24,27],[22,28,24,28],[23,17,24,17],[23,18,24,18],[24,19,24,21],[22,25,24,25],[14,23,21,33],[16,4,20,4],[16,13,20,13],[16,18,20,18],[16,19,16,21],[17,5,20,5],[17,9,20,9],[17,14,20,14],[17,15,20,15],[17,17,20,17],[12,15,12,21],[13,1,13,2],[14,1,24,1],[14,2,24,2],[14,3,24,3],[14,4,15,17],[14,18,15,21],[17,19,22,19],[17,21,22,21],[20,20,22,20],[5,24,5,25],[6,24,6,25],[7,24,7,25],[8,24,8,25],[9,24,9,25],[10,24,10,25],[0,1,0,2],[1,24,1,25],[2,24,2,25],[3,1,3,21],[3,24,3,25],[4,24,4,25]]}
[null,"様式３－２－８－１"]
[null,"校舎施設の状況（設置者所有）",null,null,null,null,null,null,null,null,null,null,null,null,null,null,null,null,null,null,null,null,null,null,"都道府県名 1)",null,{"$f":"'様式３－２－１（学校基本情報）'!C4","v":"03岩   手"}]
[null,"非構造部材の耐震状況（令和8年5月1日時点）",null,null,null,null,null,null,null,null,null,null,null,null,null,null,null,null,null,null,null,null,null,null,"設置者名",null,{"$f":"'様式３－２－１（学校基本情報）'!C5","v":0}]
[null,null,null,null,null,null,null,null,null,null,null,null,null,null,null,null,null,null,null,null,null,null,null,null,"設置者の種別 2)",null,{"$f":"'様式３－２－１（学校基本情報）'!C6","v":0}]
[null,null,null,null,null,null,null,null,null,null,null,null,null,null,null,null,null,null,null,null,null,null,null,null,"（その他の法人の場合：　　　　　　　　　　　　　　　　　　　　　　　　　　　　　　　　　　）",null,{"$f":"'様式３－２－１（学校基本情報）'!C7","v":"（その他の法人の場合：　　　　　　　　　　　　　　　　　　　　）"}]
[null,null,null,null,null,null,null,null,null,null,null,null,null,null,null,null,null,null,null,null,null,null,null,null,"学校名",null,{"$f":"'様式３－２－１（学校基本情報）'!C8","v":0}]
[null,null,null,null,null,null,null,null,null,null,null,null,null,null,null,null,null,null,null,null,null,null,null,null,"学校コード",null,{"$f":"'様式３－２－１（学校基本情報）'!$C$9","v":""}]
[null,null,null,null,null,null,null,null,null,null,null,null,null,null,null,null,null,null,null,null,null,null,null,null,"法人番号 4)",null,{"$f":"'様式３－２－１（学校基本情報）'!C10","v":0}]
[null,null,null,null,null,null,null,null,null,null,null,null,null,null,null,null,null,null,null,null,null,null,null,null,"担当者名 5)",null,{"$f":"'様式３－２－１（学校基本情報）'!C11","v":0}]
[null,null,null,null,null,null,null,null,null,null,null,null,null,null,null,null,null,null,null,null,null,null,null,null,"担当者の直通電話",null,{"$f":"'様式３－２－１（学校基本情報）'!C12","v":0}]
[null,null,null,null,null,null,null,null,null,null,null,null,null,null,null,null,null,null,null,null,null,null,null,null,"担当者のemail",null,{"$f":"'様式３－２－１（学校基本情報）'!C13","v":0}]
[]
[null,"【避難所指定を受けている学校】",null,null,null,null,null,null,null,null,null,null,null,null,null,"令和8年5月1日現在"]
[null,"○棟数で入力"]
[null,"課程名","生徒数が一番多い課程","全棟数","１．屋内運動場等(屋体・武道場・講堂・屋内プール）で下記のいずれかに該当するものの落下防止対策（※1）\n※高さが６ｍを超える空間または、水平投影面積が200㎡を超える空間（棟単位で計算）",null,null,null,null,null,null,null,null,null,null,null,null,null,"２．左記以外の非構造部材の耐震対策実施状況\n※左記の調査対象を除いた全ての非構造部材のうち、「人に重大な被害を与える恐れがある」と設置者が判断する箇所が調査対象。",null,null,null,null,"確認用チェック欄"]
[]
[null,null,null,null,"吊り天井を有する棟数\n※高さが６ｍを超える天井または、.水平投影面積が200㎡を超える天井\n",null,null,null,null,null,null,null,null,"吊り天井を有していない棟数（Ｒ７年度に吊り天井を撤去した棟数を含む）",null,null,null,null,"（１．の調査対象を除く）全ての非構造部材のうち、「人に重大な被害を与える恐れがある」と設置者が判断する箇所の有無"]
[null,null,null,null,null,"特定天井※を有する棟数\n※高さが６mを超える、かつ、水平投影面積が200mを超える吊り天井",null,null,null,"左記以外の吊り天井を有する棟数",null,null,null,null,"総点検を実施した棟数（点検を実施せず、落下防止対策を行った棟を含む）","照明・バスケットゴールの全ての落下防止対策実施済み棟数\n(※3)",null,"対策未実施の棟数\n（一部未実施含む）",null,"耐震点検\n実施状況\n（※点検を実施せずに、耐震対策を行った箇所は点検済に含める）",null,"耐震対策実施状況\n（「対策済」には耐震点検の結果、今後の対策が不用であると判断されたものを含む）"]
[]
[]
[null,null,null,null,null,null,"総点検を実施した棟数\n（点検を実施せず、落下防止対策を行った棟を含む）","吊り天井・照明・バスケットゴールの全ての落下防止対策実施済み棟数\n(※2)","対策未実施の棟数\n（一部未実施含む）",null,"総点検を実施した棟数\n（点検を実施せず、落下防止対策を行った棟を含む）","吊り天井・照明・バスケットゴールの全ての落下防止対策実施済み棟数\n(※2)","対策未実施の棟数\n（一部未実施含む）",null,null,null,"うち、Ｒ７年度に吊り天井を撤去で対策した棟数",null,null,null,"うち、設置者による点検実施状況"]
[]
[null,null,null,null,null,null,null,null,null,null,null,null,null,null,null,null,null,null,null,null,null,null,null,"B≧C","C≧D","F≧G","G≧H","J≧K","K≧L","L≧M","Oが選択されているか","Pが選択されているか","Qが選択されているか","Rが選択されているか"]
[null,null,null,null,"A=B+F","B=D+E","C","D","E","F=H+I","G","H","I","J=L+N","K ","L","M","N","O","P","Q","R"]
[null,null,null,null,null,null,null,null,null,null,null,null,null,null,null,null,null,null,null,"※「O」で「２ 該当無し」、「3　調査中・不明」を選択された場合P、Q、Rへの記載は不要です。また、「P」で「2.一部点検実施済、もしくは点検未実施」を選択された場合、Q,Rへの記載は不要です。"]
[null,"専門課程",{"$f":"IF('様式３－２－７－１'!D27=\"\",\"\",'様式３－２－７－１'!D27)","v":""},{"$f":"'様式３－２－７－１'!E27","v":0},{"$f":"F26+J26","v":0},{"$f":"H26+I26","v":0},null,null,null,{"$f":"L26+M26","v":0},null,null,null,{"$f":"P26+R26","v":0},null,null,null,null,"（↓選択すること）","（↓選択すること）","（↓選択すること）","（↓選択すること）",null,{"$f":"IF(F26>=G26,\"OK\",\"エラー\")","v":"OK"},"OK",{"$f":"IF(J26>=K26,\"OK\",\"エラー\")","v":"OK"},"OK",{"$f":"IF(N26>=O26,\"OK\",\"エラー\")","v":"OK"},"OK","OK",{"$f":"IF(AND(D26>0,S26=$AF$71),\"エラー\",\"OK\")","v":"OK"},{"$f":"IF(AND(S26=$AF$72,T26=$AG$71),\"エラー\",\"OK\")","v":"OK"},{"$f":"IF(AND(T26=$AG$72,U26=$AH$71),\"エラー\",\"OK\")","v":"OK"},{"$f":"IF(AND(T26=$AG$72,V26=$AI$71),\"エラー\",\"OK\")","v":"OK"}]
[null,"高等課程",{"$f":"IF('様式３－２－７－１'!D28=\"\",\"\",'様式３－２－７－１'!D28)","v":""},{"$f":"'様式３－２－７－１'!E28","v":0},{"$f":"F27+J27","v":0},{"$f":"H27+I27","v":0},null,null,null,{"$f":"L27+M27","v":0},null,null,null,{"$f":"P27+R27","v":0},null,null,null,null,"（↓選択すること）","（↓選択すること）","（↓選択すること）","（↓選択すること）",null,"OK","OK","OK","OK","OK","OK","OK",{"$f":"IF(AND(D27>0,S27=$AF$71),\"エラー\",\"OK\")","v":"OK"},{"$f":"IF(AND(S27=$AF$72,T27=$AG$71),\"エラー\",\"OK\")","v":"OK"},{"$f":"IF(AND(T27=$AG$72,U27=$AH$71),\"エラー\",\"OK\")","v":"OK"},{"$f":"IF(AND(T27=$AG$72,V27=$AI$71),\"エラー\",\"OK\")","v":"OK"}]
[null,"一般課程",{"$f":"IF('様式３－２－７－１'!D29=\"\",\"\",'様式３－２－７－１'!D29)","v":""},{"$f":"'様式３－２－７－１'!E29","v":0},{"$f":"F28+J28","v":0},{"$f":"H28+I28","v":0},null,null,null,{"$f":"L28+M28","v":0},null,null,null,{"$f":"P28+R28","v":0},null,null,null,null,"（↓選択すること）","（↓選択すること）","（↓選択すること）","（↓選択すること）",null,"OK","OK","OK","OK","OK","OK","OK",{"$f":"IF(AND(D28>0,S28=$AF$71),\"エラー\",\"OK\")","v":"OK"},{"$f":"IF(AND(S28=$AF$72,T28=$AG$71),\"エラー\",\"OK\")","v":"OK"},{"$f":"IF(AND(T28=$AG$72,U28=$AH$71),\"エラー\",\"OK\")","v":"OK"},{"$f":"IF(AND(T28=$AG$72,V28=$AI$71),\"エラー\",\"OK\")","v":"OK"}]
[]
[]
[]
[null,"【避難所指定を受けていない学校】"]
[null,"○棟数で入力"]
[null,"課程名","生徒数が一番多い課程","全棟数","１．屋内運動場等(屋体・武道場・講堂・屋内プール）で下記のいずれかに該当するものの落下防止対策（※1）\n※高さが６ｍを超える空間または、水平投影面積が200㎡を超える空間（棟単位で計算）",null,null,null,null,null,null,null,null,null,null,null,null,null,"２．左記以外の非構造部材の耐震対策実施状況\n※左記の調査対象を除いた全ての非構造部材のうち、「人に重大な被害を与える恐れがある」と設置者が判断する箇所が調査対象。",null,null,null,null,"確認用チェック欄"]
[]
[null,null,null,null,"吊り天井を有する棟数\n※高さが６ｍを超える天井または、.水平投影面積が200㎡を超える天井\n",null,null,null,null,null,null,null,null,"吊り天井を有していない棟数（Ｒ７年度に吊り天井を撤去した棟数を含む）",null,null,null,null,"（１．の調査対象を除く）全ての非構造部材のうち、「人に重大な被害を与える恐れがある」と設置者が判断する箇所の有無"]
[null,null,null,null,null,"特定天井※を有する棟数\n※高さが６mを超える、かつ、水平投影面積が200mを超える吊り天井",null,null,null,"左記以外の吊り天井を有する棟数",null,null,null,null,"総点検を実施した棟数（点検を実施せず、落下防止対策を行った棟を含む）","照明・バスケットゴールの全ての落下防止対策実施済み棟数\n(※3)",null,"対策未実施の棟数\n（一部未実施含む）",null,"耐震点検\n実施状況\n（※点検を実施せずに、耐震対策を行った箇所は点検済に含める）",null,"耐震対策実施状況\n（「対策済」には耐震点検の結果、今後の対策が不用であると判断されたものを含む）"]
[]
[]
[null,null,null,null,null,null,"総点検を実施した棟数\n（点検を実施せず、落下防止対策を行った棟を含む）","吊り天井・照明・バスケットゴールの全ての落下防止対策実施済み棟数\n(※2)","対策未実施の棟数\n（一部未実施含む）",null,"総点検を実施した棟数\n（点検を実施せず、落下防止対策を行った棟を含む）","吊り天井・照明・バスケットゴールの全ての落下防止対策実施済み棟数\n(※2)","対策未実施の棟数\n（一部未実施含む）",null,null,null,"うち、Ｒ７年度に吊り天井を撤去で対策した棟数",null,null,null,"うち、設置者による点検実施状況"]
[]
[null,null,null,null,null,null,null,null,null,null,null,null,null,null,null,null,null,null,null,null,null,null,null,"B≧C","C≧D","F≧G","G≧H","J≧K","K≧L","L≧M","Oが選択されているか","Pが選択されているか","Qが選択されているか","Rが選択されているか"]
[null,null,null,null,"A=B+F","B=D+E","C","D","E","F=H+I","G","H","I","J=L+N","K ","L","M","N","O","P","Q","R"]
[null,null,null,null,null,null,null,null,null,null,null,null,null,null,null,null,null,null,null,"※「O」で「２ 該当無し」、「3　調査中・不明」を選択された場合P、Q、Rへの記載は不要です。また、「P」で「2.一部点検実施済、もしくは点検未実施」を選択された場合、Q,Rへの記載は不要です。"]
[null,"専門課程",{"$f":"IF('様式３－２－７－１'!D92=\"\",\"\",'様式３－２－７－１'!D92)","v":""},{"$f":"'様式３－２－７－１'!E92","v":0},{"$f":"F45+J45","v":0},{"$f":"H45+I45","v":0},null,null,null,{"$f":"L45+M45","v":0},null,null,null,{"$f":"P45+R45","v":0},null,null,null,null,"（↓選択すること）","（↓選択すること）","（↓選択すること）","（↓選択すること）",null,{"$f":"IF(F45>=G45,\"OK\",\"エラー\")","v":"OK"},{"$f":"IF(G45>=H45,\"OK\",\"エラー\")","v":"OK"},{"$f":"IF(J45>=K45,\"OK\",\"エラー\")","v":"OK"},"OK",{"$f":"IF(N45>=O45,\"OK\",\"エラー\")","v":"OK"},"OK","OK",{"$f":"IF(AND(D45>0,S45=$AF$71),\"エラー\",\"OK\")","v":"OK"},{"$f":"IF(AND(S45=$AF$72,T45=$AG$71),\"エラー\",\"OK\")","v":"OK"},{"$f":"IF(AND(T45=$AG$72,U45=$AH$71),\"エラー\",\"OK\")","v":"OK"},{"$f":"IF(AND(T45=$AG$72,V45=$AI$71),\"エラー\",\"OK\")","v":"OK"}]
[null,"高等課程",{"$f":"IF('様式３－２－７－１'!D93=\"\",\"\",'様式３－２－７－１'!D93)","v":""},{"$f":"'様式３－２－７－１'!E93","v":0},{"$f":"F46+J46","v":0},{"$f":"H46+I46","v":0},null,null,null,{"$f":"L46+M46","v":0},null,null,null,{"$f":"P46+R46","v":0},null,null,null,null,"（↓選択すること）","（↓選択すること）","（↓選択すること）","（↓選択すること）",null,"OK","OK","OK","OK","OK","OK","OK",{"$f":"IF(AND(D46>0,S46=$AF$71),\"エラー\",\"OK\")","v":"OK"},{"$f":"IF(AND(S46=$AF$72,T46=$AG$71),\"エラー\",\"OK\")","v":"OK"},{"$f":"IF(AND(T46=$AG$72,U46=$AH$71),\"エラー\",\"OK\")","v":"OK"},{"$f":"IF(AND(T46=$AG$72,V46=$AI$71),\"エラー\",\"OK\")","v":"OK"}]
[null,"一般課程",{"$f":"IF('様式３－２－７－１'!D94=\"\",\"\",'様式３－２－７－１'!D94)","v":""},{"$f":"'様式３－２－７－１'!E94","v":0},{"$f":"F47+J47","v":0},{"$f":"H47+I47","v":0},null,null,null,{"$f":"L47+M47","v":0},null,null,null,{"$f":"P47+R47","v":0},null,null,null,null,"（↓選択すること）","（↓選択すること）","（↓選択すること）","（↓選択すること）",null,"OK","OK","OK","OK","OK","OK","OK",{"$f":"IF(AND(D47>0,S47=$AF$71),\"エラー\",\"OK\")","v":"OK"},{"$f":"IF(AND(S47=$AF$72,T47=$AG$71),\"エラー\",\"OK\")","v":"OK"},{"$f":"IF(AND(T47=$AG$72,U47=$AH$71),\"エラー\",\"OK\")","v":"OK"},{"$f":"IF(AND(T47=$AG$72,V47=$AI$71),\"エラー\",\"OK\")","v":"OK"}]
[]
[]
[]
[]
[]
[]
[]
[]
[null,null,null,null,null,null,null,null,null,null,null,null,null,null,null,null,null,null,null,{"$f":"IF(COUNTIF(X15:AH47,\"エラー\")=0,\"OK\",\"エラー\")","v":"OK"}]
[]
[]
[]
[null,null,null,null,null,null,null,null,null,null,null,null,null,null,null,null,null,null,null,{"$f":"IF(T56=\"エラー\",\"右欄外のエラー欄を確認し、エラーが出ている箇所を修正してください\",\"\")","v":""}]
[]
[]
[]
[]
[]
[]
[]
[]
[]
[]
[null,null,null,null,null,null,null,null,null,null,null,null,null,null,null,null,null,null,null,null,null,null,null,null,null,null,null,null,null,null,null,"（↓選択すること）","（↓選択すること）","（↓選択すること）","（↓選択すること）"]
[null,null,null,null,null,null,null,null,null,null,null,null,null,null,null,null,null,null,null,null,null,null,null,null,null,null,null,null,null,null,null,"1.該当あり","1.全箇所点検実施済","1.全箇所“設置者”が点検","1.全て対策済"]
[null,null,null,null,null,null,null,null,null,null,null,null,null,null,null,null,null,null,null,null,null,null,null,null,null,null,null,null,null,null,null,"2.該当なし","2.一部点検実施済、もしくは点検未実施","2.一部もしくは全部“学校教職員”が点検","2.一部対策済"]
[null,null,null,null,null,null,null,null,null,null,null,null,null,null,null,null,null,null,null,null,null,null,null,null,null,null,null,null,null,null,null,"3.調査中・不明",null,null,"3.対策未実施"]
[]
[]
[]
[null,"課程名","生徒数が一番多い課程","全棟数","１．屋内運動場等(屋体・武道場・講堂・屋内プール）で下記のいずれかに該当するものの落下防止対策（※1）\n※高さが６ｍを超える空間または、水平投影面積が200㎡を超える空間（棟単位で計算）",null,null,null,null,null,null,null,null,null,null,null,null,null,"２．左記以外の非構造部材の耐震対策実施状況\n※左記の調査対象を除いた全ての非構造部材のうち、「人に重大な被害を与える恐れがある」と設置者が判断する箇所が調査対象。",null,null,null,null,"確認用チェック欄"]
[]
[null,null,null,null,"吊り天井を有する棟数\n※高さが６ｍを超える天井または、.水平投影面積が200㎡を超える天井\n",null,null,null,null,null,null,null,null,"吊り天井を有していない棟数（H27年度に吊り天井を撤去した棟数を含む）",null,null,null,null,"（１．の調査対象を除く）全ての非構造部材のうち、「人に重大な被害を与える恐れがある」と設置者が判断する箇所の有無"]
[null,null,null,null,null,"特定天井※を有する棟数\n※高さが６mを超える、かつ、水平投影面積が200mを超える吊り天井",null,null,null,"左記以外の吊り天井を有する棟数",null,null,null,null,"総点検を実施した棟数（点検を実施せず、落下防止対策を行った棟を含む）","照明・バスケットゴールの全ての落下防止対策実施済み棟数\n(※3)",null,"対策未実施の棟数\n（一部未実施含む）",null,"耐震点検\n実施状況\n（※点検を実施せずに、耐震対策を行った箇所は点検済に含める）",null,"耐震対策実施状況\n（「対策済」には耐震点検の結果、今後の対策が不用であると判断されたものを含む）"]
[]
[]
[null,null,null,null,null,null,"総点検を実施した棟数\n（点検を実施せず、落下防止対策を行った棟を含む）","吊り天井・照明・バスケットゴールの全ての落下防止対策実施済み棟数\n(※2)","対策未実施の棟数\n（一部未実施含む）",null,"総点検を実施した棟数\n（点検を実施せず、落下防止対策を行った棟を含む）","吊り天井・照明・バスケットゴールの全ての落下防止対策実施済み棟数\n(※2)","対策未実施の棟数\n（一部未実施含む）",null,null,null,"うち、H27年度に吊り天井を撤去で対策した棟数",null,null,null,"うち、設置者による点検実施状況"]
[]
[null,null,null,null,null,null,null,null,null,null,null,null,null,null,null,null,null,null,null,null,null,null,null,"B≧C","C≧D","F≧G","G≧H","J≧K","K≧L","L≧M"]
[null,null,null,null,"A=B+F","B=D+E","C","D","E","F=H+I","G","H","I","J=L+N","K ","L","M","N","O","P","Q","R"]
[null,null,null,null,null,null,null,null,null,null,null,null,null,null,null,null,null,null,null,"※「O」で「２ 該当無し」、「3　調査中・不明」を選択された場合P、Q、Rへの記載は不要です。また、「P」で「2.一部点検実施済、もしくは点検未実施」を選択された場合、Q,Rへの記載は不要です。"]
[null,"専門課程",{"$f":"CONCATENATE(C26,C45)","v":""},{"$f":"SUM(D45,D26)","v":0},{"$f":"F89+J89","v":0},{"$f":"H89+I89","v":0},{"$f":"SUM(G45,G26)","v":0},0,0,{"$f":"L89+M89","v":0},{"$f":"SUM(K45,K26)","v":0},0,0,{"$f":"P89+R89","v":0},{"$f":"SUM(O45,O26)","v":0},0,0,0,{"$f":"IF(D89>0,IF(COUNTIF(S26,$AF$72)+COUNTIF(S45,$AF$72)>=1,$AF$72,IF(COUNTIF(S26,$AF$74)+COUNTIF(S45,$AF$74)>=1,$AF$74,$AF$73)),\"\")","v":""},{"$f":"IF(S89=$AF$72,IF(COUNTIF(T26,$AG$73)+COUNTIF(T45,$AG$73)>0,$AG$73,$AG$72),\"\")","v":""},{"$f":"IF(T89=$AG$72,IF(COUNTIF(U26,$AH$73)+COUNTIF(U45,$AH$73)>0,$AH$73,$AH$72),\"\")","v":""},{"$f":"IF(T89=$AG$72,IF(COUNTIF(V26,$AI$73)+COUNTIF(V45,$AI$73)>=1,$AI$73,IF(COUNTIF(V26,$AI$72)+COUNTIF(V45,$AI$74)=2,$AI$73,IF(COUNTIF(V26,$AI$74)+COUNTIF(V45,$AI$72)=2,$AI$73,IF(COUNTIF(V26,$AI$72)+COUNTIF(V45,$AI$72)>=1,$AI$72,IF(COUNTIF(V26,$AI$74)+COUNTIF(V45,$AI$74)=2,$AI$74,\"\"))))),\"\")","v":""},null,{"$f":"IF(F89>=G89,\"OK\",\"エラー\")","v":"OK"},"OK",{"$f":"IF(J89>=K89,\"OK\",\"エラー\")","v":"OK"},"OK",{"$f":"IF(N89>=O89,\"OK\",\"エラー\")","v":"OK"},"OK","OK"]
[null,"高等課程",{"$f":"CONCATENATE(C27,C46)","v":""},{"$f":"SUM(D46,D27)","v":0},{"$f":"F90+J90","v":0},{"$f":"H90+I90","v":0},0,0,0,{"$f":"L90+M90","v":0},0,0,0,{"$f":"P90+R90","v":0},0,0,0,0,{"$f":"IF(D90>0,IF(COUNTIF(S27,$AF$72)+COUNTIF(S46,$AF$72)>=1,$AF$72,IF(COUNTIF(S27,$AF$74)+COUNTIF(S46,$AF$74)>=1,$AF$74,$AF$73)),\"\")","v":""},{"$f":"IF(S90=$AF$72,IF(COUNTIF(T27,$AG$73)+COUNTIF(T46,$AG$73)>0,$AG$73,$AG$72),\"\")","v":""},{"$f":"IF(T90=$AG$72,IF(COUNTIF(U27,$AH$73)+COUNTIF(U46,$AH$73)>0,$AH$73,$AH$72),\"\")","v":""},{"$f":"IF(T90=$AG$72,IF(COUNTIF(V27,$AI$73)+COUNTIF(V46,$AI$73)>=1,$AI$73,IF(COUNTIF(V27,$AI$72)+COUNTIF(V46,$AI$74)=2,$AI$73,IF(COUNTIF(V27,$AI$74)+COUNTIF(V46,$AI$72)=2,$AI$73,IF(COUNTIF(V27,$AI$72)+COUNTIF(V46,$AI$72)>=1,$AI$72,IF(COUNTIF(V27,$AI$74)+COUNTIF(V46,$AI$74)=2,$AI$74,\"\"))))),\"\")","v":""},null,"OK","OK","OK","OK","OK","OK","OK"]
[null,"一般課程",{"$f":"CONCATENATE(C28,C47)","v":""},{"$f":"SUM(D47,D28)","v":0},{"$f":"F91+J91","v":0},{"$f":"H91+I91","v":0},0,0,0,{"$f":"L91+M91","v":0},0,0,0,{"$f":"P91+R91","v":0},0,0,0,0,{"$f":"IF(D91>0,IF(COUNTIF(S28,$AF$72)+COUNTIF(S47,$AF$72)>=1,$AF$72,IF(COUNTIF(S28,$AF$74)+COUNTIF(S47,$AF$74)>=1,$AF$74,$AF$73)),\"\")","v":""},{"$f":"IF(S91=$AF$72,IF(COUNTIF(T28,$AG$73)+COUNTIF(T47,$AG$73)>0,$AG$73,$AG$72),\"\")","v":""},{"$f":"IF(T91=$AG$72,IF(COUNTIF(U28,$AH$73)+COUNTIF(U47,$AH$73)>0,$AH$73,$AH$72),\"\")","v":""},{"$f":"IF(T91=$AG$72,IF(COUNTIF(V28,$AI$73)+COUNTIF(V47,$AI$73)>=1,$AI$73,IF(COUNTIF(V28,$AI$72)+COUNTIF(V47,$AI$74)=2,$AI$73,IF(COUNTIF(V28,$AI$74)+COUNTIF(V47,$AI$72)=2,$AI$73,IF(COUNTIF(V28,$AI$72)+COUNTIF(V47,$AI$72)>=1,$AI$72,IF(COUNTIF(V28,$AI$74)+COUNTIF(V47,$AI$74)=2,$AI$74,\"\"))))),\"\")","v":""},null,"OK","OK","OK","OK","OK","OK","OK"]

{"sheet":"（回答不用）様式３－２－８－２","index":10,"n_rows":91,"n_cols":35,"rows_kept":91,"cut":false,"hidden":false,"merged":[[85,29,87,29],[86,4,87,4],[86,5,87,5],[86,6,87,6],[86,7,87,7],[86,8,87,8],[86,9,87,9],[86,10,87,10],[86,11,87,11],[86,12,87,12],[85,23,87,23],[85,24,87,24],[85,25,87,25],[85,26,87,26],[85,27,87,27],[85,28,87,28],[77,23,84,29],[79,4,83,4],[79,13,83,13],[79,18,83,18],[79,19,79,21],[80,5,83,5],[80,9,83,9],[80,14,83,14],[80,15,83,15],[80,17,83,17],[55,19,57,20],[42,9,43,9],[42,10,43,10],[42,11,43,11],[42,12,43,12],[42,13,43,13],[42,14,43,14],[59,19,66,22],[77,1,87,1],[77,2,87,2],[77,3,87,3],[77,4,78,17],[77,18,78,21],[80,19,85,19],[80,21,85,21],[83,20,85,20],[86,13,87,13],[86,14,87,14],[86,15,87,15],[86,16,87,16],[86,17,87,17],[86,18,87,18],[87,19,87,21],[41,29,43,29],[41,30,43,30],[41,31,43,31],[41,32,43,32],[41,33,43,33],[42,4,43,4],[42,5,43,5],[42,6,43,6],[42,7,43,7],[42,8,43,8],[41,23,43,23],[41,24,43,24],[41,25,43,25],[41,26,43,26],[41,27,43,27],[41,28,43,28],[42,15,43,15],[42,16,43,16],[42,17,43,17],[42,18,43,18],[43,19,43,21],[33,23,40,33],[35,4,39,4],[35,13,39,13],[35,18,39,18],[35,19,35,21],[36,5,39,5],[36,9,39,9],[36,14,39,14],[36,15,39,15],[36,17,39,17],[30,1,30,21],[32,1,32,2],[33,1,43,1],[33,2,43,2],[33,3,43,3],[33,4,34,17],[33,18,34,21],[36,19,41,19],[36,21,41,21],[39,20,41,20],[28,4,28,17],[23,9,24,9],[23,10,24,10],[23,11,24,11],[23,12,24,12],[23,13,24,13],[23,14,24,14],[23,16,24,16],[23,15,24,15],[22,33,24,33],[23,4,24,4],[23,5,24,5],[23,6,24,6],[23,7,24,7],[23,8,24,8],[22,23,24,23],[22,24,24,24],[22,29,24,29],[22,26,24,26],[22,30,24,30],[22,31,24,31],[22,32,24,32],[22,27,24,27],[22,28,24,28],[23,17,24,17],[23,18,24,18],[24,19,24,21],[22,25,24,25],[14,23,21,33],[16,4,20,4],[16,13,20,13],[16,18,20,18],[16,19,16,21],[17,5,20,5],[17,9,20,9],[17,14,20,14],[17,15,20,15],[17,17,20,17],[12,15,12,21],[13,1,13,2],[14,1,24,1],[14,2,24,2],[14,3,24,3],[14,4,15,17],[14,18,15,21],[17,19,22,19],[17,21,22,21],[20,20,22,20],[5,24,5,25],[6,24,6,25],[7,24,7,25],[8,24,8,25],[9,24,9,25],[10,24,10,25],[0,1,0,2],[1,24,1,25],[2,24,2,25],[3,1,3,21],[3,24,3,25],[4,24,4,25]]}
[null,"様式３－２－８－２"]
[null,"校舎施設の状況（借用）",null,null,null,null,null,null,null,null,null,null,null,null,null,null,null,null,null,null,null,null,null,null,"都道府県名 1)",null,{"$error":"#REF!"}]
[null,"非構造部材の耐震状況（令和元年5月1日時点）",null,null,null,null,null,null,null,null,null,null,null,null,null,null,null,null,null,null,null,null,null,null,"設置者名",null,{"$error":"#REF!"}]
[null,null,null,null,null,null,null,null,null,null,null,null,null,null,null,null,null,null,null,null,null,null,null,null,"設置者の種別 2)",null,{"$error":"#REF!"}]
[null,null,null,null,null,null,null,null,null,null,null,null,null,null,null,null,null,null,null,null,null,null,null,null,"（その他の法人の場合：　　　　　　　　　　　　　　　　　　　　　　　　　　　　　　　　　　）",null,"（その他の法人の場合：　　　　　　　　　　　　　　　　　　　　）"]
[null,null,null,null,null,null,null,null,null,null,null,null,null,null,null,null,null,null,null,null,null,null,null,null,"学校名",null,{"$error":"#REF!"}]
[null,null,null,null,null,null,null,null,null,null,null,null,null,null,null,null,null,null,null,null,null,null,null,null,"学校基本調査番号 3)",null,{"$error":"#REF!"}]
[null,null,null,null,null,null,null,null,null,null,null,null,null,null,null,null,null,null,null,null,null,null,null,null,"法人番号 4)",null,{"$error":"#REF!"}]
[null,null,null,null,null,null,null,null,null,null,null,null,null,null,null,null,null,null,null,null,null,null,null,null,null,null,{"$error":"#REF!"}]
[null,null,null,null,null,null,null,null,null,null,null,null,null,null,null,null,null,null,null,null,null,null,null,null,null,null,{"$error":"#REF!"}]
[null,null,null,null,null,null,null,null,null,null,null,null,null,null,null,null,null,null,null,null,null,null,null,null,null,null,{"$error":"#REF!"}]
[]
[null,"【避難所指定を受けている学校】",null,null,null,null,null,null,null,null,null,null,null,null,null,"令和元年5月1日現在"]
[null,"○棟数で入力"]
[null,"課程名","生徒数が一番多い課程","全棟数","１．屋内運動場等(屋体・武道場・講堂・屋内プール）で下記のいずれかに該当するものの落下防止対策（※1）\n※高さが６ｍを超える空間または、水平投影面積が200㎡を超える空間（棟単位で計算）",null,null,null,null,null,null,null,null,null,null,null,null,null,"２．左記以外の非構造部材の耐震対策実施状況\n※左記の調査対象を除いた全ての非構造部材のうち、「人に重大な被害を与える恐れがある」と設置者が判断する箇所が調査対象。",null,null,null,null,"確認用チェック欄"]
[]
[null,null,null,null,"吊り天井を有する棟数\n※高さが６ｍを超える天井または、.水平投影面積が200㎡を超える天井\n",null,null,null,null,null,null,null,null,"吊り天井を有していない棟数（H30年度に吊り天井を撤去した棟数を含む）",null,null,null,null,"（１．の調査対象を除く）全ての非構造部材のうち、「人に重大な被害を与える恐れがある」と設置者が判断する箇所の有無"]
[null,null,null,null,null,"特定天井※を有する棟数\n※高さが６mを超える、かつ、水平投影面積が200mを超える吊り天井",null,null,null,"左記以外の吊り天井を有する棟数",null,null,null,null,"総点検を実施した棟数（点検を実施せず、落下防止対策を行った棟を含む）","照明・バスケットゴールの全ての落下防止対策実施済み棟数\n(※3)",null,"対策未実施の棟数\n（一部未実施含む）",null,"耐震点検\n実施状況\n（※点検を実施せずに、耐震対策を行った箇所は点検済に含める）",null,"耐震対策実施状況\n（「対策済」には耐震点検の結果、今後の対策が不用であると判断されたものを含む）"]
[]
[]
[null,null,null,null,null,null,"総点検を実施した棟数\n（点検を実施せず、落下防止対策を行った棟を含む）","吊り天井・照明・バスケットゴールの全ての落下防止対策実施済み棟数\n(※2)","対策未実施の棟数\n（一部未実施含む）",null,"総点検を実施した棟数\n（点検を実施せず、落下防止対策を行った棟を含む）","吊り天井・照明・バスケットゴールの全ての落下防止対策実施済み棟数\n(※2)","対策未実施の棟数\n（一部未実施含む）",null,null,null,"うち、H30年度に吊り天井を撤去で対策した棟数",null,null,null,"うち、設置者による点検実施状況"]
[]
[null,null,null,null,null,null,null,null,null,null,null,null,null,null,null,null,null,null,null,null,null,null,null,"B≧C","C≧D","F≧G","G≧H","J≧K","K≧L","L≧M","Oが選択されているか","Pが選択されているか","Qが選択されているか","Rが選択されているか"]
[null,null,null,null,"A=B+F","B=D+E","C","D","E","F=H+I","G","H","I","J=L+N","K ","L","M","N","O","P","Q","R"]
[null,null,null,null,null,null,null,null,null,null,null,null,null,null,null,null,null,null,null,"※「O」で「２ 該当無し」、「3　調査中・不明」を選択された場合P、Q、Rへの記載は不要です。また、「P」で「2.一部点検実施済、もしくは点検未実施」を選択された場合、Q,Rへの記載は不要です。"]
[null,"専門課程",{"$error":"#REF!"},{"$error":"#REF!"},{"$f":"F26+J26","v":0},{"$f":"H26+I26","v":0},null,null,null,{"$f":"L26+M26","v":0},null,null,null,{"$f":"P26+R26","v":0},null,null,null,null,"（↓選択すること）","（↓選択すること）","（↓選択すること）","（↓選択すること）",null,{"$f":"IF(F26>=G26,\"OK\",\"エラー\")","v":"OK"},"OK",{"$f":"IF(J26>=K26,\"OK\",\"エラー\")","v":"OK"},"OK",{"$f":"IF(N26>=O26,\"OK\",\"エラー\")","v":"OK"},"OK","OK",{"$f":"IF(AND(D26>0,S26=$AF$71),\"エラー\",\"OK\")","v":{"$error":"#REF!"}},{"$f":"IF(AND(S26=$AF$72,T26=$AG$71),\"エラー\",\"OK\")","v":"OK"},{"$f":"IF(AND(T26=$AG$72,U26=$AH$71),\"エラー\",\"OK\")","v":"OK"},{"$f":"IF(AND(T26=$AG$72,V26=$AI$71),\"エラー\",\"OK\")","v":"OK"}]
[null,"高等課程",{"$error":"#REF!"},{"$error":"#REF!"},{"$f":"F27+J27","v":0},{"$f":"H27+I27","v":0},null,null,null,{"$f":"L27+M27","v":0},null,null,null,{"$f":"P27+R27","v":0},null,null,null,null,"（↓選択すること）","（↓選択すること）","（↓選択すること）","（↓選択すること）",null,"OK","OK","OK","OK","OK","OK","OK",{"$f":"IF(AND(D27>0,S27=$AF$71),\"エラー\",\"OK\")","v":{"$error":"#REF!"}},{"$f":"IF(AND(S27=$AF$72,T27=$AG$71),\"エラー\",\"OK\")","v":"OK"},{"$f":"IF(AND(T27=$AG$72,U27=$AH$71),\"エラー\",\"OK\")","v":"OK"},{"$f":"IF(AND(T27=$AG$72,V27=$AI$71),\"エラー\",\"OK\")","v":"OK"}]
[null,"一般課程",{"$error":"#REF!"},{"$error":"#REF!"},{"$f":"F28+J28","v":0},{"$f":"H28+I28","v":0},null,null,null,{"$f":"L28+M28","v":0},null,null,null,{"$f":"P28+R28","v":0},null,null,null,null,"（↓選択すること）","（↓選択すること）","（↓選択すること）","（↓選択すること）",null,"OK","OK","OK","OK","OK","OK","OK",{"$f":"IF(AND(D28>0,S28=$AF$71),\"エラー\",\"OK\")","v":{"$error":"#REF!"}},{"$f":"IF(AND(S28=$AF$72,T28=$AG$71),\"エラー\",\"OK\")","v":"OK"},{"$f":"IF(AND(T28=$AG$72,U28=$AH$71),\"エラー\",\"OK\")","v":"OK"},{"$f":"IF(AND(T28=$AG$72,V28=$AI$71),\"エラー\",\"OK\")","v":"OK"}]
[]
[]
[]
[null,"【避難所指定を受けていない学校】"]
[null,"○棟数で入力"]
[null,"課程名","生徒数が一番多い課程","全棟数","１．屋内運動場等(屋体・武道場・講堂・屋内プール）で下記のいずれかに該当するものの落下防止対策（※1）\n※高さが６ｍを超える空間または、水平投影面積が200㎡を超える空間（棟単位で計算）",null,null,null,null,null,null,null,null,null,null,null,null,null,"２．左記以外の非構造部材の耐震対策実施状況\n※左記の調査対象を除いた全ての非構造部材のうち、「人に重大な被害を与える恐れがある」と設置者が判断する箇所が調査対象。",null,null,null,null,"確認用チェック欄"]
[]
[null,null,null,null,"吊り天井を有する棟数\n※高さが６ｍを超える天井または、.水平投影面積が200㎡を超える天井\n",null,null,null,null,null,null,null,null,"吊り天井を有していない棟数（H30年度に吊り天井を撤去した棟数を含む）",null,null,null,null,"（１．の調査対象を除く）全ての非構造部材のうち、「人に重大な被害を与える恐れがある」と設置者が判断する箇所の有無"]
[null,null,null,null,null,"特定天井※を有する棟数\n※高さが６mを超える、かつ、水平投影面積が200mを超える吊り天井",null,null,null,"左記以外の吊り天井を有する棟数",null,null,null,null,"総点検を実施した棟数（点検を実施せず、落下防止対策を行った棟を含む）","照明・バスケットゴールの全ての落下防止対策実施済み棟数\n(※3)",null,"対策未実施の棟数\n（一部未実施含む）",null,"耐震点検\n実施状況\n（※点検を実施せずに、耐震対策を行った箇所は点検済に含める）",null,"耐震対策実施状況\n（「対策済」には耐震点検の結果、今後の対策が不用であると判断されたものを含む）"]
[]
[]
[null,null,null,null,null,null,"総点検を実施した棟数\n（点検を実施せず、落下防止対策を行った棟を含む）","吊り天井・照明・バスケットゴールの全ての落下防止対策実施済み棟数\n(※2)","対策未実施の棟数\n（一部未実施含む）",null,"総点検を実施した棟数\n（点検を実施せず、落下防止対策を行った棟を含む）","吊り天井・照明・バスケットゴールの全ての落下防止対策実施済み棟数\n(※2)","対策未実施の棟数\n（一部未実施含む）",null,null,null,"うち、H30年度に吊り天井を撤去で対策した棟数",null,null,null,"うち、設置者による点検実施状況"]
[]
[null,null,null,null,null,null,null,null,null,null,null,null,null,null,null,null,null,null,null,null,null,null,null,"B≧C","C≧D","F≧G","G≧H","J≧K","K≧L","L≧M","Oが選択されているか","Pが選択されているか","Qが選択されているか","Rが選択されているか"]
[null,null,null,null,"A=B+F","B=D+E","C","D","E","F=H+I","G","H","I","J=L+N","K ","L","M","N","O","P","Q","R"]
[null,null,null,null,null,null,null,null,null,null,null,null,null,null,null,null,null,null,null,"※「O」で「２ 該当無し」、「3　調査中・不明」を選択された場合P、Q、Rへの記載は不要です。また、「P」で「2.一部点検実施済、もしくは点検未実施」を選択された場合、Q,Rへの記載は不要です。"]
[null,"専門課程",{"$error":"#REF!"},{"$error":"#REF!"},{"$f":"F45+J45","v":0},{"$f":"H45+I45","v":0},null,null,null,{"$f":"L45+M45","v":0},null,null,null,{"$f":"P45+R45","v":0},null,null,null,null,"（↓選択すること）","（↓選択すること）","（↓選択すること）","（↓選択すること）",null,{"$f":"IF(F45>=G45,\"OK\",\"エラー\")","v":"OK"},{"$f":"IF(G45>=H45,\"OK\",\"エラー\")","v":"OK"},{"$f":"IF(J45>=K45,\"OK\",\"エラー\")","v":"OK"},"OK",{"$f":"IF(N45>=O45,\"OK\",\"エラー\")","v":"OK"},"OK","OK",{"$f":"IF(AND(D45>0,S45=$AF$71),\"エラー\",\"OK\")","v":{"$error":"#REF!"}},{"$f":"IF(AND(S45=$AF$72,T45=$AG$71),\"エラー\",\"OK\")","v":"OK"},{"$f":"IF(AND(T45=$AG$72,U45=$AH$71),\"エラー\",\"OK\")","v":"OK"},{"$f":"IF(AND(T45=$AG$72,V45=$AI$71),\"エラー\",\"OK\")","v":"OK"}]
[null,"高等課程",{"$error":"#REF!"},{"$error":"#REF!"},{"$f":"F46+J46","v":0},{"$f":"H46+I46","v":0},null,null,null,{"$f":"L46+M46","v":0},null,null,null,{"$f":"P46+R46","v":0},null,null,null,null,"（↓選択すること）","（↓選択すること）","（↓選択すること）","（↓選択すること）",null,"OK","OK","OK","OK","OK","OK","OK",{"$f":"IF(AND(D46>0,S46=$AF$71),\"エラー\",\"OK\")","v":{"$error":"#REF!"}},{"$f":"IF(AND(S46=$AF$72,T46=$AG$71),\"エラー\",\"OK\")","v":"OK"},{"$f":"IF(AND(T46=$AG$72,U46=$AH$71),\"エラー\",\"OK\")","v":"OK"},{"$f":"IF(AND(T46=$AG$72,V46=$AI$71),\"エラー\",\"OK\")","v":"OK"}]
[null,"一般課程",{"$error":"#REF!"},{"$error":"#REF!"},{"$f":"F47+J47","v":0},{"$f":"H47+I47","v":0},null,null,null,{"$f":"L47+M47","v":0},null,null,null,{"$f":"P47+R47","v":0},null,null,null,null,"（↓選択すること）","（↓選択すること）","（↓選択すること）","（↓選択すること）",null,"OK","OK","OK","OK","OK","OK","OK",{"$f":"IF(AND(D47>0,S47=$AF$71),\"エラー\",\"OK\")","v":{"$error":"#REF!"}},{"$f":"IF(AND(S47=$AF$72,T47=$AG$71),\"エラー\",\"OK\")","v":"OK"},{"$f":"IF(AND(T47=$AG$72,U47=$AH$71),\"エラー\",\"OK\")","v":"OK"},{"$f":"IF(AND(T47=$AG$72,V47=$AI$71),\"エラー\",\"OK\")","v":"OK"}]
[]
[]
[]
[]
[]
[]
[]
[]
[null,null,null,null,null,null,null,null,null,null,null,null,null,null,null,null,null,null,null,{"$f":"IF(COUNTIF(X15:AH47,\"エラー\")=0,\"OK\",\"エラー\")","v":"OK"}]
[]
[]
[]
[null,null,null,null,null,null,null,null,null,null,null,null,null,null,null,null,null,null,null,{"$f":"IF(T56=\"エラー\",\"右欄外のエラー欄を確認し、エラーが出ている箇所を修正してください\",\"\")","v":""}]
[]
[]
[]
[]
[]
[]
[]
[]
[]
[]
[null,null,null,null,null,null,null,null,null,null,null,null,null,null,null,null,null,null,null,null,null,null,null,null,null,null,null,null,null,null,null,"（↓選択すること）","（↓選択すること）","（↓選択すること）","（↓選択すること）"]
[null,null,null,null,null,null,null,null,null,null,null,null,null,null,null,null,null,null,null,null,null,null,null,null,null,null,null,null,null,null,null,"1.該当あり","1.全箇所点検実施済","1.全箇所“設置者”が点検","1.全て対策済"]
[null,null,null,null,null,null,null,null,null,null,null,null,null,null,null,null,null,null,null,null,null,null,null,null,null,null,null,null,null,null,null,"2.該当なし","2.一部点検実施済、もしくは点検未実施","2.一部もしくは全部“学校教職員”が点検","2.一部対策済"]
[null,null,null,null,null,null,null,null,null,null,null,null,null,null,null,null,null,null,null,null,null,null,null,null,null,null,null,null,null,null,null,"3.調査中・不明",null,null,"3.対策未実施"]
[]
[]
[]
[null,"課程名","生徒数が一番多い課程","全棟数","１．屋内運動場等(屋体・武道場・講堂・屋内プール）で下記のいずれかに該当するものの落下防止対策（※1）\n※高さが６ｍを超える空間または、水平投影面積が200㎡を超える空間（棟単位で計算）",null,null,null,null,null,null,null,null,null,null,null,null,null,"２．左記以外の非構造部材の耐震対策実施状況\n※左記の調査対象を除いた全ての非構造部材のうち、「人に重大な被害を与える恐れがある」と設置者が判断する箇所が調査対象。",null,null,null,null,"確認用チェック欄"]
[]
[null,null,null,null,"吊り天井を有する棟数\n※高さが６ｍを超える天井または、.水平投影面積が200㎡を超える天井\n",null,null,null,null,null,null,null,null,"吊り天井を有していない棟数（H27年度に吊り天井を撤去した棟数を含む）",null,null,null,null,"（１．の調査対象を除く）全ての非構造部材のうち、「人に重大な被害を与える恐れがある」と設置者が判断する箇所の有無"]
[null,null,null,null,null,"特定天井※を有する棟数\n※高さが６mを超える、かつ、水平投影面積が200mを超える吊り天井",null,null,null,"左記以外の吊り天井を有する棟数",null,null,null,null,"総点検を実施した棟数（点検を実施せず、落下防止対策を行った棟を含む）","照明・バスケットゴールの全ての落下防止対策実施済み棟数\n(※3)",null,"対策未実施の棟数\n（一部未実施含む）",null,"耐震点検\n実施状況\n（※点検を実施せずに、耐震対策を行った箇所は点検済に含める）",null,"耐震対策実施状況\n（「対策済」には耐震点検の結果、今後の対策が不用であると判断されたものを含む）"]
[]
[]
[null,null,null,null,null,null,"総点検を実施した棟数\n（点検を実施せず、落下防止対策を行った棟を含む）","吊り天井・照明・バスケットゴールの全ての落下防止対策実施済み棟数\n(※2)","対策未実施の棟数\n（一部未実施含む）",null,"総点検を実施した棟数\n（点検を実施せず、落下防止対策を行った棟を含む）","吊り天井・照明・バスケットゴールの全ての落下防止対策実施済み棟数\n(※2)","対策未実施の棟数\n（一部未実施含む）",null,null,null,"うち、H27年度に吊り天井を撤去で対策した棟数",null,null,null,"うち、設置者による点検実施状況"]
[]
[null,null,null,null,null,null,null,null,null,null,null,null,null,null,null,null,null,null,null,null,null,null,null,"B≧C","C≧D","F≧G","G≧H","J≧K","K≧L","L≧M"]
[null,null,null,null,"A=B+F","B=D+E","C","D","E","F=H+I","G","H","I","J=L+N","K ","L","M","N","O","P","Q","R"]
[null,null,null,null,null,null,null,null,null,null,null,null,null,null,null,null,null,null,null,"※「O」で「２ 該当無し」、「3　調査中・不明」を選択された場合P、Q、Rへの記載は不要です。また、「P」で「2.一部点検実施済、もしくは点検未実施」を選択された場合、Q,Rへの記載は不要です。"]
[null,"専門課程",{"$f":"CONCATENATE(C26,C45)","v":{"$error":"#REF!"}},{"$f":"SUM(D45,D26)","v":{"$error":"#REF!"}},{"$f":"F89+J89","v":0},{"$f":"H89+I89","v":0},{"$f":"SUM(G45,G26)","v":0},{"$f":"SUM(H45,H26)","v":0},{"$f":"SUM(I45,I26)","v":0},{"$f":"L89+M89","v":0},{"$f":"SUM(K45,K26)","v":0},0,0,{"$f":"P89+R89","v":0},{"$f":"SUM(O45,O26)","v":0},0,0,0,{"$f":"IF(D89>0,IF(COUNTIF(S26,$AF$72)+COUNTIF(S45,$AF$72)>=1,$AF$72,IF(COUNTIF(S26,$AF$74)+COUNTIF(S45,$AF$74)>=1,$AF$74,$AF$73)),\"\")","v":{"$error":"#REF!"}},{"$f":"IF(S89=$AF$72,IF(COUNTIF(T26,$AG$73)+COUNTIF(T45,$AG$73)>0,$AG$73,$AG$72),\"\")","v":{"$error":"#REF!"}},{"$f":"IF(T89=$AG$72,IF(COUNTIF(U26,$AH$73)+COUNTIF(U45,$AH$73)>0,$AH$73,$AH$72),\"\")","v":{"$error":"#REF!"}},{"$f":"IF(T89=$AG$72,IF(COUNTIF(V26,$AI$73)+COUNTIF(V45,$AI$73)>=1,$AI$73,IF(COUNTIF(V26,$AI$72)+COUNTIF(V45,$AI$74)=2,$AI$73,IF(COUNTIF(V26,$AI$74)+COUNTIF(V45,$AI$72)=2,$AI$73,IF(COUNTIF(V26,$AI$72)+COUNTIF(V45,$AI$72)>=1,$AI$72,IF(COUNTIF(V26,$AI$74)+COUNTIF(V45,$AI$74)=2,$AI$74,\"\"))))),\"\")","v":{"$error":"#REF!"}},null,{"$f":"IF(F89>=G89,\"OK\",\"エラー\")","v":"OK"},"OK",{"$f":"IF(J89>=K89,\"OK\",\"エラー\")","v":"OK"},"OK",{"$f":"IF(N89>=O89,\"OK\",\"エラー\")","v":"OK"},"OK","OK"]
[null,"高等課程",{"$f":"CONCATENATE(C27,C46)","v":{"$error":"#REF!"}},{"$f":"SUM(D46,D27)","v":{"$error":"#REF!"}},{"$f":"F90+J90","v":0},{"$f":"H90+I90","v":0},{"$f":"SUM(G46,G27)","v":0},0,0,{"$f":"L90+M90","v":0},0,0,0,{"$f":"P90+R90","v":0},0,0,0,0,{"$f":"IF(D90>0,IF(COUNTIF(S27,$AF$72)+COUNTIF(S46,$AF$72)>=1,$AF$72,IF(COUNTIF(S27,$AF$74)+COUNTIF(S46,$AF$74)>=1,$AF$74,$AF$73)),\"\")","v":{"$error":"#REF!"}},{"$f":"IF(S90=$AF$72,IF(COUNTIF(T27,$AG$73)+COUNTIF(T46,$AG$73)>0,$AG$73,$AG$72),\"\")","v":{"$error":"#REF!"}},{"$f":"IF(T90=$AG$72,IF(COUNTIF(U27,$AH$73)+COUNTIF(U46,$AH$73)>0,$AH$73,$AH$72),\"\")","v":{"$error":"#REF!"}},{"$f":"IF(T90=$AG$72,IF(COUNTIF(V27,$AI$73)+COUNTIF(V46,$AI$73)>=1,$AI$73,IF(COUNTIF(V27,$AI$72)+COUNTIF(V46,$AI$74)=2,$AI$73,IF(COUNTIF(V27,$AI$74)+COUNTIF(V46,$AI$72)=2,$AI$73,IF(COUNTIF(V27,$AI$72)+COUNTIF(V46,$AI$72)>=1,$AI$72,IF(COUNTIF(V27,$AI$74)+COUNTIF(V46,$AI$74)=2,$AI$74,\"\"))))),\"\")","v":{"$error":"#REF!"}},null,"OK","OK","OK","OK","OK","OK","OK"]
[null,"一般課程",{"$f":"CONCATENATE(C28,C47)","v":{"$error":"#REF!"}},{"$f":"SUM(D47,D28)","v":{"$error":"#REF!"}},{"$f":"F91+J91","v":0},{"$f":"H91+I91","v":0},0,0,0,{"$f":"L91+M91","v":0},0,0,0,{"$f":"P91+R91","v":0},0,0,0,0,{"$f":"IF(D91>0,IF(COUNTIF(S28,$AF$72)+COUNTIF(S47,$AF$72)>=1,$AF$72,IF(COUNTIF(S28,$AF$74)+COUNTIF(S47,$AF$74)>=1,$AF$74,$AF$73)),\"\")","v":{"$error":"#REF!"}},{"$f":"IF(S91=$AF$72,IF(COUNTIF(T28,$AG$73)+COUNTIF(T47,$AG$73)>0,$AG$73,$AG$72),\"\")","v":{"$error":"#REF!"}},{"$f":"IF(T91=$AG$72,IF(COUNTIF(U28,$AH$73)+COUNTIF(U47,$AH$73)>0,$AH$73,$AH$72),\"\")","v":{"$error":"#REF!"}},{"$f":"IF(T91=$AG$72,IF(COUNTIF(V28,$AI$73)+COUNTIF(V47,$AI$73)>=1,$AI$73,IF(COUNTIF(V28,$AI$72)+COUNTIF(V47,$AI$74)=2,$AI$73,IF(COUNTIF(V28,$AI$74)+COUNTIF(V47,$AI$72)=2,$AI$73,IF(COUNTIF(V28,$AI$72)+COUNTIF(V47,$AI$72)>=1,$AI$72,IF(COUNTIF(V28,$AI$74)+COUNTIF(V47,$AI$74)=2,$AI$74,\"\"))))),\"\")","v":{"$error":"#REF!"}},null,"OK","OK","OK","OK","OK","OK","OK"]

{"sheet":"様式３－２－８（項目定義）","index":11,"n_rows":31,"n_cols":7,"rows_kept":31,"cut":false,"hidden":false,"merged":[[28,3,28,4],[28,6,28,10],[29,6,29,10],[30,3,30,4],[30,6,30,10],[27,2,27,4],[27,6,27,10],[19,2,19,4],[19,6,19,10],[20,3,20,4],[20,6,20,10],[21,3,21,4],[21,6,21,10],[22,6,22,10],[23,3,23,4],[23,6,23,10],[26,2,26,5],[26,6,26,10],[15,3,15,4],[15,6,15,10],[16,3,18,3],[16,6,16,10],[17,6,17,10],[18,6,18,10],[14,6,14,10],[1,1,1,10],[2,1,2,10],[9,2,9,5],[9,6,9,10],[10,2,10,4],[10,6,10,10],[11,2,12,2],[11,3,11,4],[11,6,11,10],[12,6,12,10],[13,6,13,10]]}
[]
[null,"・学校施設の非構造部材の耐震化ガイドブック（改訂版）   地震による落下物や転倒物から子供たちを守るために   －耐震点検の実施－（平成27年3月文部科学省）"]
[null,"・学校施設の非構造部材の耐震化ガイドブック（追補版）   地震による落下物や転倒物から子供たちを守るために   －耐震点検の実施－（平成31年3月文部科学省）"]
[null,null,"http://www.mext.go.jp/a_menu/shisetu/shuppan/1291462.htm "]
[]
[null,"・学校施設における天井等落下防止対策のための手引（平成25年8月）"]
[null,null,"http://www.mext.go.jp/a_menu/shisetu/bousai/taishin/1341100.htm"]
[]
[null,null,"１．屋内運動場等の吊り天井等の落下防止対策（棟単位）"]
[null,null,"調査表の項目",null,null,null,"説明"]
[null,null,"吊り天井を有する棟数\n※高さが6mを超える天井、または水平投影面積が200㎡を超える天井",null,null,"A","吊り天井を有する棟数の中で、落下防止対策が必要な棟数（屋内運動場・武道場・講堂・屋内プールの中で、文部科学省が平成25年8月7日（25文科施第201号）に示した対象となる建物であり、以下のいずれかに該当するもの）を記入してください。\n１．高さが六メートルを超える天井\n２．水平投影面積が二百平方メートルを超える天井※天井面構成部材等の単位面積質量（天井面の面積の１平方メートル当たりの質量をいう）が２ｋｇ以下の棟については「吊り天井を有していない棟（J）」に含まれます。\n※本項目は自動計算のため記入不要\n※吊り天井を有する建物とは、その施設の主な用途として使用されるアリーナ部分などに吊り天井を有している建物とします。よって、例えば器具倉庫や更衣室といった室は調査対象外です。\n※校舎一体型の屋内運動場や、屋内運動場内にアリーナが複数ある場合や武道場・講堂・屋内プールが室として複合的に配置されている場合は、室数を棟数と見なして記入してください。また、校舎の教室を改修し武道場や講堂として利用している場合も上記１又は２に該当すれば対象施設とします。"]
[null,null,null,"特定天井を有する棟数\n※高さが6mを超える、かつ水平投影面積が200㎡を超える吊り天井を有する棟数",null,"B","A（吊り天井を有する棟数）のうち、高さが6ｍを超える、かつ水平投影面積が200㎡を超える吊り天井を有する建物の棟数\n※本項目は自動計算のため記入不要"]
[null,null,null,null,"総点検を実施した棟数","C","B（高さが6mを超える、または水平投影面積が200㎡を超える吊り天井を有する棟数）のうち総点検を実施した棟数を記入してください。総点検を実施した棟数とは、屋内運動場等の吊り天井等については、設置者（専門家や設計事務所等への委託を含む。）が「学校施設における天井等落下防止対策のための手引（平成25年8月）」（以下、「手引」という。）の「天井等総点検用マニュアルのフローチャート」（9ページ）などを参考にし、総点検を実施した棟数を記入してください。（必ずしも手引による必要はありません。）また、屋内運動場等の照明器具・バスケットゴールについては、手引の「照明器具、バスケットゴール等の取付部分の耐震点検と対策の実施」（55～59ページ）等を参考にした総点検を設置者が実施している棟数を記入してください。\n※吊り天井・照明器具・バスケットゴールのどれか一つでも未点検であれば、「点検未実施」とします。\n※専門家により点検を実施した場合も「総点検を実施した棟数」として記入してください。\n※対策方法が決定しているか否かは問いません。\n※総点検を実施せずに落下防止対策を実施した場合は、総点検を実施したこととみなしてください。"]
[null,null,null,null,"吊り天井・照明・バスケットゴールの全ての落下防止対策済み棟数","D","B（高さが6mを超える、または水平投影面積が200㎡を超える吊り天井を有する棟数）のうち耐震対策を実施した棟数を記入してください。吊り天井に係る脱落防止措置については、国土交通省が平成25年8月に示した「技術基準」における脱落防止措置の規定を満たしている棟数を記入してください。また、照明器具、バスケットゴールの落下防止対策については、手引の「照明器具、バスケットゴール等の取付部分の耐震点検と対策の実施」（55～59ページ）等を参考に対策を実施した棟数を記入してください。\n※耐震点検の結果、すでに対策が実施されていた棟数も含めてください。\n※吊り天井・照明器具・バスケットゴールのどれか一つでも未対策であれば、「対策未実施」とします。\n※例えば、吊り天井の耐震対策は終了していても工事契約が終了していない場合は「対策未実施」とします。"]
[null,null,null,null,"対策未実施の棟数（一部未実施含む）","E","B（高さが6mを超える、かつ、水平投影面積が200㎡を超える吊り天井を有する棟数）のうち手引等を参考にした対策を設置者が実施していない棟数及び、総点検未実施の棟数の合計を記入してください（一部対策未実施の棟も含む。）。"]
[null,null,null,"左記以外の吊り天井を有する棟数",null,"F","A（吊り天井を有する棟数）のうち、B（高さが6mを超える、または水平投影面積が200㎡を超える吊り天井を有する棟数）を除く、建物の棟数※本項目は自動計算のため記入不要"]
[null,null,null,null,"総点検を実施した棟数","G","F（左記以外の吊り天井を有する棟数）のうち、手引等を参考にした総点検を設置者が実施した棟数を記入してください。\n※吊り天井・照明器具・バスケットゴールのどれか一つでも未点検であれば、「点検未実施」とします。\n※専門家により点検を実施した場合も「総点検を実施した棟数」として記入してください。\n※対策方法が決定しているか否かは問いません。\n※総点検を実施せずに落下防止対策を実施した場合は、総点検を実施したこととみなしてください。"]
[null,null,null,null,"吊り天井・照明・バスケットゴールの全ての落下防止対策済み棟数","H","F（左記以外の吊り天井を有する棟数）のうち、手引き等を参考にした耐震対策を設置者が実施した棟数を記入してください。\n※耐震点検の結果、すでに対策が実施されていた棟数も含めてください。\n※吊り天井・照明器具・バスケットゴールのどれか一つでも未対策であれば、「対策未実施」とします。\n※例えば、吊り天井の耐震対策は終了していても工事契約が終了していない場合は「対策未実施」とします。"]
[null,null,null,null,"対策未実施の棟数（一部未実施含む）","I","F（左記以外の吊り天井を有する棟数）のうち、手引等を参考にした対策を設置者が実施していない棟数及び、総点検未実施の棟数の合計を記入してください。（一部対策未実施の棟も含む。）"]
[null,null,"吊り天井を有していない棟数（Ｒ７年度に吊り天井を撤去した棟数を含む）",null,null,"J","高さが６ｍを超える又は面積が２００㎡超の空間を有する屋体等の全棟数のうち、吊り天井を有していない棟数\n※本項目は自動計算のため記入不要\n※器具倉庫、更衣室等のごく一部のみに吊り天井を有する棟は、吊り天井を有していない棟数とします。\n※令和７年度より以前に天井を撤去した棟も含みます。\n※吊り天井以外の直天井等（膜天井を含む）についても、吊り天井を有していない棟数とします。\n※天井面構成部材等の単位面積質量（天井面の面積の１平方メートル当たりの質量をいう）が２ｋｇ以下の棟については、ここに該当します。"]
[null,null,null,"総点検を実施した棟数 ",null,"K ","上記のうち、照明器具・バスケットゴールのどちらも手引等を参考にした 総点検を学校法人が実施した棟数を記入してください。\n ※専門家により点検を実施した場合も「総点検を実施した棟数」として 記入してください。\n ※総点検を実施せずに落下防止対策を実施した場合は、総点検を実施したこ ととみなしてください。 "]
[null,null,null,"照明・バスケットゴールの全ての落下防止対策済み棟数",null,"L","照明器具、バスケットゴールの全てに対して、手引等を参考にした対策を設置者が実施している棟数を記入してください。\n※耐震点検の結果、すでに対策が実施されていた棟数も含めてください。"]
[null,null,null,null,"うち、Ｒ７年度に吊り天井を撤去で対策した棟数","M","令和７年度中に吊り天井を撤去で対策した棟数を記入してください。\n※令和６年度より以前に撤去したものについては除いてください。"]
[null,null,null,"対策未実施の棟数（一部未実施含む）",null,"N","総点検を設置者が実施していない棟数及び、総点検を実施した棟数の中で、対策未実施の棟数を記入してください。（一部対策未実施の棟も含む。）"]
[]
[null,null,"２．非構造部材の耐震対策（各課程毎）"]
[null,null,"項    目 ",null,null,null,"説       明 "]
[null,null,"全ての非構造部材のうち、「人に重大な被害を与える恐れがある」と設置者が判断する箇所の有無",null,null,"O","建物全ての非構造部材（屋体等の天井等を除く。）の中で、各設置者が、人に重大な被害を与える恐れがあると判断する箇所の有無について選択してください。\n※「１．該当あり」の場合は、P～Q欄で点検・対策状況を選択してください。\n※「２．該当なし」「３．調査中・不明」の場合は、P欄以降の回答は不要です。"]
[null,null,"耐震点検状況","耐震点検実施状況",null,"P","０（各設置者が、人に重大な被害を与える恐れがあると判断する箇所）について、設置者又は学校教職員による点検実施状況を選択してください。\n※「設置者による点検」とは、 令和8年5月1日より過去3年以内に実施した点検で、建築物に関する専門的な知識を要する項目で、専門家と相談しながら実施したものを言います。ただし、内部に専門家がいる場合は、必ずしも外部の専門家である必要はありません。\n※「学校教職員による点検」とは 令和8年5月1日より過去1年以内に実施した点検で、施設を日常的に使用する者として、何らかの異変がないか確認し、その点検結果を設置者に報告し、設置者が点検する際の参考とすることが目的とするものをいいます。 \n※全ての非構造部材のうち、「屋内運動場等の吊り天井等の落下防止対策」の調査対象である屋内運動場、武道場、講堂、屋内プールの吊り天井、照明器具、バスケットゴールについては調査対象外とし、これらを除いた建物全ての非構造部材のうち、人に重大な被害を与える恐れがあると判断する箇所が調査の対象です。\n※必要な点検項目は各学校の状況等に応じて異なります。ガイドブック等を参考に（必ずガイドブック等に沿った点検方法に限定する必要はありません）各設置者が、人に重大な被害を与える恐れがあると判断する箇所について、必要な点検を実施していると考える場合も、「耐震点検実施済」とします。\n※耐震点検として、設置者が人に重大な被害を与える恐れがあると判断する箇所について、建築基準法第１２条に基づく調査または点検を活用して点検を実施した場合、「耐震点検実施校」とします。\n※竣工後三年以内の建物は竣工検査をもって耐震点検を実施したものとみなします。\n※耐震点検を実施せずに耐震対策を実施した棟については、「耐震点検実施済」とみなしてください。"]
[null,null,null,null,"うち、設置者による点検実施状況","Q","建物全ての非構造部材（屋体等の天井等を除く。）の中で、各設置者が、人に重大な被害を与える恐れがあると判断する箇所について、設置者による点検実施状況を選択してください。\n※全箇所「設置者」による点検を実施している場合は「１．全箇所“設置者”が点検」を選択し、それ以外の場合（一部のみ設置者が点検若しくは全部を学校教職員（学校）が実施）は、「2．一部若しくは全部“学校教職員が点検”」を選択してください。"]
[null,null,"耐震対策状況","耐震対策実施状況",null,"R","設置者が、人に重大な被害を与える恐れがあると判断する箇所について、耐震対策の実施状況を選択してください。\n※耐震点検の結果を踏まえ、人に重大な被害を与える恐れがあると判断する箇所について、全て「耐震対策を実施済（耐震点検の結果、今後の対策が不要であると判断」された場合を含む）」である場合に「１．全て対策済」を選択してしてください。\n※人に重大な被害を与える恐れがないと判断する箇所の対策が未実施でも、人に重大な被害を与える恐れがあると判断する箇所を全て耐震対策していれば「耐震対策実施済み」とみなして記入してください。"]

{"sheet":"様式３－２－９","index":12,"n_rows":32,"n_cols":16,"rows_kept":32,"cut":false,"hidden":false,"merged":[[12,1,12,4],[12,7,12,10],[13,1,13,4],[13,7,13,10],[17,1,17,13],[24,14,25,14],[0,1,0,2],[2,1,2,6],[3,1,3,9],[6,1,6,5],[6,7,6,11],[7,1,7,4],[7,7,7,10],[8,1,8,4],[8,7,8,10],[9,1,9,4],[9,7,9,10],[10,1,10,4],[10,7,10,10],[11,1,11,4],[11,7,11,10]]}
[]
[null,"様式３－２－９"]
[]
[null,"専修学校の校舎施設のバリアフリー化対応状況（令和8年5月1日時点）"]
[]
[null,"○設置者所有の建物",null,null,null,null,null,"○借用の建物"]
[null,"整備している設備（複数選択可）",null,null,null,null,null,"整備している設備（複数選択可）"]
[null,"　エレベータ",null,null,null,null,null,"　エレベータ"]
[null,"　車いす用駐車場",null,null,null,null,null,"　車いす用駐車場"]
[null,"　障害者等用トイレ（車イス用トイレ）",null,null,null,null,null,"　障害者等用トイレ（車イス用トイレ）"]
[null,"　 手すり",null,null,null,null,null,"　手すり"]
[null,"　スロープ",null,null,null,null,null,"　スロープ"]
[null,"　盲人用誘導ブロック・警告ブロック",null,null,null,null,null,"　盲人用誘導ブロック・警告ブロック"]
[null,"　自動ドア",null,null,null,null,null,"　自動ドア"]
[]
[null,"[注] 1)水色セル内について、それぞれの施設設備を整備している場合、ドロップダウンリストから「○」を選択し、整備していない場合は「×」を選択すること。 "]
[null,"　　 2)各項とも令和8年5月1日現在の状況を記入すること。"]
[]
[]
[]
[]
[]
[null,null,null,null,null,null,null,null,null,null,null,null,null,null,"都道府県名 1)",{"$f":"'様式３－２－１（学校基本情報）'!$C$4","v":"03岩   手"}]
[null,null,null,null,null,null,null,null,null,null,null,null,null,null,"設置者名",{"$f":"'様式３－２－１（学校基本情報）'!$C$5","v":0}]
[null,null,null,null,null,null,null,null,null,null,null,null,null,null,"設置者の種別 2)",{"$f":"'様式３－２－１（学校基本情報）'!$C$6","v":0}]
[null,null,null,null,null,null,null,null,null,null,null,null,null,null,null,{"$f":"'様式３－２－１（学校基本情報）'!$C$7","v":"（その他の法人の場合：　　　　　　　　　　　　　　　　　　　　）"}]
[null,null,null,null,null,null,null,null,null,null,null,null,null,null,"学校名",{"$f":"'様式３－２－１（学校基本情報）'!$C$8","v":0}]
[null,null,null,null,null,null,null,null,null,null,null,null,null,null,"学校コード",{"$f":"'様式３－２－１（学校基本情報）'!$C$9","v":""}]
[null,null,null,null,null,null,null,null,null,null,null,null,null,null,"法人番号 4)",{"$f":"'様式３－２－１（学校基本情報）'!$C$10","v":0}]
[null,null,null,null,null,null,null,null,null,null,null,null,null,null,"担当者名 5)",{"$f":"'様式３－２－１（学校基本情報）'!$C$11","v":0}]
[null,null,null,null,null,null,null,null,null,null,null,null,null,null,"担当者の直通電話",{"$f":"'様式３－２－１（学校基本情報）'!$C$12","v":0}]
[null,null,null,null,null,null,null,null,null,null,null,null,null,null,"担当者のemail",{"$f":"'様式３－２－１（学校基本情報）'!$C$13","v":0}]

{"sheet":"（回答不要）学校コード","index":13,"n_rows":3053,"n_cols":3,"rows_kept":3053,"cut":false,"hidden":false,"merged":[]}
["文部科学省　学校コード"]
["学校名","学校コード","都道府県番号"]
["国立函館視力障害センター","H101110000017","01(北海道)"]
["市立函館病院高等看護学院","H101220200012","01(北海道)"]
["小樽市立高等看護学院","H101220300020","01(北海道)"]
["北海道立旭川高等看護学院","H101220400010","01(北海道)"]
["北海道立北の森づくり専門学院","H101220400118","01(北海道)"]
["市立室蘭看護専門学院","H101220500019","01(北海道)"]
["釧路市立高等看護学院","H101220600063","01(北海道)"]
["帯広高等看護学院","H101220700053","01(北海道)"]
["岩見沢市立高等看護学院","H101221000021","01(北海道)"]
["北海道立紋別高等看護学院","H101221900013","01(北海道)"]
["滝川市立高等看護学院","H101222500015","01(北海道)"]
["砂川市立病院附属看護専門学校","H101222600014","01(北海道)"]
["深川市立高等看護学院","H101222800012","01(北海道)"]
["富良野看護専門学校","H101222900011","01(北海道)"]
["北海道立江差高等看護学院","H101236100019","01(北海道)"]
["北海道介護福祉学校","H101242900019","01(北海道)"]
["北海道立農業大学校","H101264600016","01(北海道)"]
["修学院札幌調理師専門学校","H101310100012","01(北海道)"]
["せいとく介護こども福祉専門学校","H101310100021","01(北海道)"]
["札幌ファッションデザイン専門学校ＤＯＲＥＭＥ","H101310100030","01(北海道)"]
["北海道理容美容専門学校","H101310100049","01(北海道)"]
["光塩学園調理製菓専門学校","H101310100058","01(北海道)"]
["札幌情報未来専門学校","H101310100067","01(北海道)"]
["札幌歯科学院専門学校","H101310100076","01(北海道)"]
["公益社団法人北海道柔道整復師会附属北海道柔道整復専門学校","H101310100085","01(北海道)"]
["北海道美容専門学校","H101310100094","01(北海道)"]
["札幌ＹＭＣＡ英語・コミュニケーション専門学校","H101310100101","01(北海道)"]
["札幌医学技術福祉歯科専門学校","H101310100110","01(北海道)"]
["札幌サウンドアート専門学校","H101310100129","01(北海道)"]
["札幌科学技術専門学校","H101310100138","01(北海道)"]
["札幌医療秘書福祉専門学校","H101310100147","01(北海道)"]
["青山建築デザイン・医療事務専門学校","H101310100156","01(北海道)"]
["専門学校札幌デザイナー学院","H101310100165","01(北海道)"]
["北海道どうぶつ・医療専門学校","H101310100174","01(北海道)"]
["札幌お茶の水医療秘書歯科助手専門学校","H101310100183","01(北海道)"]
["札幌お茶の水アーバンビジネス専門学校","H101310100192","01(北海道)"]
["専門学校北海道福祉・保育大学校","H101310100209","01(北海道)"]
["専門学校北海道リハビリテーション大学校","H101310100218","01(北海道)"]
["札幌心療福祉専門学校","H101310100227","01(北海道)"]
["専門学校札幌ビジュアルアーツ","H101310100236","01(北海道)"]
["札幌リハビリテーション専門学校","H101310100245","01(北海道)"]
["札幌ビューティーアート専門学校","H101310100254","01(北海道)"]
["札幌ベルエポック製菓調理ウエディング専門学校","H101310100263","01(北海道)"]
["札幌青葉鍼灸柔整専門学校","H101310100272","01(北海道)"]
["札幌スポーツアンドメディカル専門学校","H101310100281","01(北海道)"]
["札幌どうぶつ専門学校","H101310100290","01(北海道)"]
["札幌ベルエポック美容専門学校","H101310100307","01(北海道)"]
["吉田学園医療歯科専門学校","H101310100316","01(北海道)"]
["札幌こども専門学校","H101310100325","01(北海道)"]
["北海道歯科衛生士専門学校","H101310100334","01(北海道)"]
["札幌マンガ・アニメ＆声優専門学校","H101310100343","01(北海道)"]
["札幌ブライダルアンドホテル観光専門学校","H101310100352","01(北海道)"]
["愛犬美容看護専門学校","H101310100361","01(北海道)"]
["札幌観光ブライダル・製菓専門学校","H101310100370","01(北海道)"]
["札幌ミュージック＆ダンス・放送専門学校","H101310100389","01(北海道)"]
["札幌デザイン＆テクノロジー専門学校","H101310100398","01(北海道)"]
["北海道看護専門学校","H101310100405","01(北海道)"]
["札幌スイーツアンドカフェ専門学校","H101310100414","01(北海道)"]
["吉田学園公務員法科専門学校","H101310100432","01(北海道)"]
["専修学校クラーク高等学院札幌大通校","H101310100441","01(北海道)"]
["宮島学園北海道ファッション専門学校","H101310200011","01(北海道)"]
["北海道芸術デザイン専門学校","H101310200020","01(北海道)"]
["大原簿記情報専門学校札幌校","H101310200039","01(北海道)"]
["北海道医薬専門学校","H101310200048","01(北海道)"]
["大原医療福祉専門学校","H101310200057","01(北海道)"]
["札幌医療リハビリ専門学校","H101310200066","01(北海道)"]
["大原法律公務員専門学校","H101310200075","01(北海道)"]
["専修学校代々木ゼミナール札幌校","H101310200084","01(北海道)"]
["宮島学園北海道調理師専門学校","H101310300010","01(北海道)"]
["勤医協札幌看護専門学校","H101310300029","01(北海道)"]
["札幌工科専門学校","H101310300038","01(北海道)"]
["吉田学園情報ビジネス専門学校","H101310300047","01(北海道)"]
["北海道スポーツ専門学校","H101310300056","01(北海道)"]
["専門学校北海道自動車整備大学校","H101310300065","01(北海道)"]
["吉田学園動物看護専門学校","H101310300074","01(北海道)"]
["三草会札幌看護専門学校","H101310300083","01(北海道)"]
["北海道情報専門学校","H101310400019","01(北海道)"]
["札幌商工会議所付属専門学校","H101310400028","01(北海道)"]
["北海道中央調理技術専門学校","H101310500018","01(北海道)"]
["経専音楽放送芸術専門学校","H101310500027","01(北海道)"]
["経専調理製菓専門学校","H101310500036","01(北海道)"]
["北海道農業専門学校","H101310500045","01(北海道)"]
["北海道文化服装専門学校","H101310500054","01(北海道)"]
["池上学院グローバルアカデミー専門学校","H101310500063","01(北海道)"]
["経専北海道どうぶつ専門学校","H101310600017","01(北海道)"]
["経専北海道保育専門学校","H101310600026","01(北海道)"]
["中村記念病院附属看護学校","H101310600035","01(北海道)"]
["宮島学園北海道製菓専門学校","H101310600044","01(北海道)"]
["経専医療事務薬業専門学校","H101310600053","01(北海道)"]
["経専北海道観光専門学校","H101310600062","01(北海道)"]
["札幌看護医療専門学校","H101310600071","01(北海道)"]
["北海道鍼灸専門学校","H101310700016","01(北海道)"]
["琴似看護専門学校","H101310700025","01(北海道)"]
["明日佳幼児教育専門学校","H101310700034","01(北海道)"]
["独立行政法人国立病院機構北海道医療センター附属札幌看護学校","H101310700043","01(北海道)"]
["函館理容美容専門学校","H101320200029","01(北海道)"]
["函館看護専門学校","H101320200038","01(北海道)"]
["函館短期大学付設調理製菓専門学校","H101320200047","01(北海道)"]
["函館市医師会看護・リハビリテーション専門学院","H101320200056","01(北海道)"]
["函館厚生院看護専門学校","H101320200065","01(北海道)"]
["専修学校ロシア極東大函館校","H101320200074","01(北海道)"]
["函館臨床福祉専門学校","H101320200083","01(北海道)"]
["函館歯科衛生士専門学校","H101320200092","01(北海道)"]
["大原公務員・医療事務・語学専門学校函館校","H101320200109","01(北海道)"]
["小樽歯科衛生士専門学校","H101320300019","01(北海道)"]
["小樽市医師会看護高等専修学校","H101320300046","01(北海道)"]
["専門学校国際インテリアアカデミー","H101320300055","01(北海道)"]
["小樽看護専門学校","H101320300064","01(北海道)"]
["旭川理容美容専門学校","H101320400027","01(北海道)"]
["旭川調理師専門学校","H101320400036","01(北海道)"]
["北海道医学技術専門学校","H101320400045","01(北海道)"]
["旭川歯科学院専門学校","H101320400054","01(北海道)"]
["旭川医療秘書専門学校","H101320400063","01(北海道)"]
["旭川市医師会看護専門学校","H101320400072","01(北海道)"]
["旭川大学情報ビジネス専門学校","H101320400081","01(北海道)"]
["ＪＡ北海道厚生連旭川厚生看護専門学校","H101320400090","01(北海道)"]
["北都保健福祉専門学校","H101320400107","01(北海道)"]
["北海道福祉教育専門学校","H101320500026","01(北海道)"]
["日鋼記念看護学校","H101320500035","01(北海道)"]
["北斗文化学園インターナショナル調理技術専門学校","H101320500044","01(北海道)"]
["くしろせんもん学校","H101320600016","01(北海道)"]
["釧路服飾専門学校","H101320600034","01(北海道)"]
["独立行政法人労働者健康安全機構釧路労災看護専門学校","H101320600043","01(北海道)"]
["釧路経営経理専門学校","H101320600052","01(北海道)"]
["釧路理容美容専門学校","H101320600070","01(北海道)"]
["釧路市医師会看護専門学校","H101320600089","01(北海道)"]
["釧路孝仁会看護専門学校","H101320600098","01(北海道)"]
["帯広文化専門学校","H101320700015","01(北海道)"]
["帯広テクニカ専門学校","H101320700024","01(北海道)"]
["帯広調理師専門学校","H101320700033","01(北海道)"]
["帯広市医師会看護高等専修学校","H101320700042","01(北海道)"]
["帯広コア専門学校","H101320700060","01(北海道)"]
["北海道社会事業協会帯広看護専門学校","H101320700079","01(北海道)"]
["北見商科高等専修学校","H101320800014","01(北海道)"]
["北見美容専門学校","H101320800023","01(北海道)"]
["北見医師会看護専門学校","H101320800032","01(北海道)"]
["北見情報ビジネス専門学校","H101320800041","01(北海道)"]
["オホーツク社会福祉専門学校","H101320800050","01(北海道)"]
["駒沢看護専門学校","H101321000010","01(北海道)"]
["岩見沢市医師会附属看護高等専修学校","H101321000038","01(北海道)"]
["網走文化専門学校","H101321100028","01(北海道)"]
["苫小牧高等商業学校","H101321300017","01(北海道)"]
["苫小牧看護専門学校","H101321300026","01(北海道)"]
["王子総合病院附属看護専門学校","H101321300035","01(北海道)"]
["専門学校北日本自動車大学校","H101321600014","01(北海道)"]
["専門学校日本航空大学校","H101322400014","01(北海道)"]
["日本工学院北海道専門学校","H101323000016","01(北海道)"]
["北海道ハイテクノロジー専門学校","H101323100015","01(北海道)"]
["北海道エコ・動物自然専門学校","H101323100024","01(北海道)"]
["伊達赤十字看護専門学校","H101323300013","01(北海道)"]
["情報芸術学院","H101323300022","01(北海道)"]
["北海道歯科技術専門学校","H101323400012","01(北海道)"]
["北海道医療大学歯学部附属歯科衛生士専門学校","H101330300018","01(北海道)"]
["北海道航空専門学校","H101340800012","01(北海道)"]
["旭川福祉専門学校","H101345800011","01(北海道)"]
["遠軽服装専門学校","H101355500013","01(北海道)"]
["専修学校ＣＥＡ学園","H101360100017","01(北海道)"]
["浦河赤十字看護専門学校","H101360700011","01(北海道)"]
["掘削技術専門学校","H101366800017","01(北海道)"]
["青森市立高等看護学院","H102210000014","02(青森)"]
["八戸市立高等看護学院","H102210000023","02(青森)"]
["青森県営農大学校","H102210000032","02(青森)"]
["五所川原市立高等看護学院","H102210000041","02(青森)"]
["青森中央文化専門学校","H102310000012","02(青森)"]
["青森歯科医療専門学校","H102310000021","02(青森)"]
["青森ビジネス専門学校","H102310000030","02(青森)"]
["青森中央経理専門学校","H102310000049","02(青森)"]
["青森県ビューティー＆メディカル専門学校","H102310000058","02(青森)"]
["東奥保育・福祉専門学院","H102310000067","02(青森)"]
["弘前厚生学院","H102310000076","02(青森)"]
["東北栄養専門学校","H102310000085","02(青森)"]
["サンモードスクールオブデザイン","H102310000094","02(青森)"]
["Ｓ．Ｋ．Ｋ．情報ビジネス専門学校","H102310000101","02(青森)"]
["青森県ヘアアーチスト専門学校","H102310000110","02(青森)"]
["独立行政法人国立病院機構弘前総合医療センター附属看護学校","H102310000129","02(青森)"]
["弘前市医師会看護専門学校","H102310000138","02(青森)"]
["八戸ドレメ専門学校","H102310000147","02(青森)"]
["八戸理容美容専門学校","H102310000165","02(青森)"]
["専門学校アレック情報ビジネス学院","H102310000174","02(青森)"]
["八戸看護専門学校","H102310000183","02(青森)"]
["八戸社会福祉専門学校","H102310000192","02(青森)"]
["八戸保健医療専門学校","H102310000209","02(青森)"]
["モーリ技芸専門学校","H102310000218","02(青森)"]
["東北メディカル学院","H102310000227","02(青森)"]
["一般財団法人双仁会厚生看護専門学校","H102310000236","02(青森)"]
["岩手県立宮古高等看護学院","H103220200010","03(岩手)"]
["岩手県立一関高等看護学院","H103220900013","03(岩手)"]
["岩手県立二戸高等看護学院","H103221300017","03(岩手)"]
["岩手県立農業大学校","H103238100013","03(岩手)"]
["岩手看護専門学校","H103320100019","03(岩手)"]
["北日本ヘアスタイリストカレッジ","H103320100028","03(岩手)"]
["盛岡ヘアメイク専門学校","H103320100037","03(岩手)"]
["菜園調理師専門学校","H103320100046","03(岩手)"]
["岩手リハビリテーション学院","H103320100055","03(岩手)"]
["盛岡情報ビジネス＆デザイン専門学校","H103320100064","03(岩手)"]
["盛岡社会福祉専門学校","H103320100073","03(岩手)"]
["上野法律ビジネス専門学校","H103320100082","03(岩手)"]
["盛岡外語観光＆ブライダル専門学校","H103320100091","03(岩手)"]
["盛岡医療福祉スポーツ専門学校","H103320100108","03(岩手)"]
["北日本ハイテクニカルクッキングカレッジ","H103320100117","03(岩手)"]
["専修学校盛岡中央ゼミナール","H103320100126","03(岩手)"]
["岩手医科大学医療専門学校","H103320100135","03(岩手)"]
["北日本医療福祉専門学校","H103320100144","03(岩手)"]
["盛岡ペットワールド専門学校","H103320100153","03(岩手)"]
["盛岡公務員法律専門学校","H103320100162","03(岩手)"]
["岩手公務員・医療・ビジネス専門学校","H103320100171","03(岩手)"]
["大原スポーツ公務員専門学校盛岡校","H103320100180","03(岩手)"]
["大原簿記情報ビジネス医療福祉専門学校盛岡校","H103320100199","03(岩手)"]
["盛岡看護医療大学校","H103320100206","03(岩手)"]
["花巻高等看護専門学校","H103320500015","03(岩手)"]
["岩手理容美容専門学校","H103320500024","03(岩手)"]
["専修大学北上福祉教育専門学校","H103320600014","03(岩手)"]
["国際医療福祉専門学校一関校","H103320900011","03(岩手)"]
["一関市医師会附属一関准看護高等専修学校","H103320900020","03(岩手)"]
["一関市医師会附属一関看護専門学校","H103320900039","03(岩手)"]
["東北ヘアーモード学院","H103320900048","03(岩手)"]
["一関経理専門学校","H103320900057","03(岩手)"]
["水沢学苑看護専門学校","H103321500013","03(岩手)"]
["星北高等学園","H103332200013","03(岩手)"]
["宮城県高等看護学校","H104212070013","04(宮城)"]
["宮城県農業大学校","H104212070022","04(宮城)"]
["気仙沼市立病院附属看護専門学校","H104222050016","04(宮城)"]
["仙台総合ビジネス公務員専門学校","H104391010018","04(宮城)"]
["専門学校デジタルアーツ仙台","H104391010027","04(宮城)"]
["仙台青葉服飾専門学校","H104391010036","04(宮城)"]
["ファッション文化専門学校ＤＯＲＥＭＥ","H104391010045","04(宮城)"]
["国際マルチビジネス専門学校","H104391010054","04(宮城)"]
["東北外語観光専門学校","H104391010063","04(宮城)"]
["専門学校花壇自動車大学校","H104391010072","04(宮城)"]
["仙台デザイン専門学校","H104391010081","04(宮城)"]
["宮城文化服装専門学校","H104391010090","04(宮城)"]
["東北電子専門学校","H104391010107","04(宮城)"]
["東北労災看護専門学校","H104391010116","04(宮城)"]
["専門学校赤門自動車整備大学校","H104391010125","04(宮城)"]
["赤門鍼灸柔整専門学校","H104391010134","04(宮城)"]
["宮城調理製菓専門学校","H104391010143","04(宮城)"]
["仙台医療福祉専門学校","H104391010152","04(宮城)"]
["仙台総合ペット専門学校","H104391010161","04(宮城)"]
["東北文化学園専門学校","H104391010170","04(宮城)"]
["仙台大原簿記情報公務員専門学校","H104391010189","04(宮城)"]
["仙台工科専門学校","H104391010198","04(宮城)"]
["仙台ＹＭＣＡ国際ホテル専門学校","H104391010205","04(宮城)"]
["専門学校宮城高等歯科衛生士学院","H104391010214","04(宮城)"]
["仙台幼児保育専門学校","H104391010223","04(宮城)"]
["東京ＩＴプログラミング＆会計専門学校仙台校","H104391010241","04(宮城)"]
["東京法律公務員専門学校仙台校","H104391010250","04(宮城)"]
["仙台ヘアメイク専門学校","H104391010269","04(宮城)"]
["仙台国際美容専門学校","H104391010287","04(宮城)"]
["専門学校アニマルインターカレッジ","H104391010296","04(宮城)"]
["東北保健医療専門学校","H104391010303","04(宮城)"]
["キャスウェルホテルアンドブライダル専門学校","H104391010312","04(宮城)"]
["専修学校河合塾仙台校","H104391010321","04(宮城)"]
["ＳＥＮＤＡＩ中央理容美容専門学校","H104391020016","04(宮城)"]
["仙台接骨医療専門学校","H104391020025","04(宮城)"]
["上田裁縫専門学校","H104391020034","04(宮城)"]
["仙台医療秘書福祉専門学校","H104391020043","04(宮城)"]
["仙台リゾートアンドスポーツ専門学校","H104391020052","04(宮城)"]
["専門学校仙台カレッジオブデザイン","H104391020061","04(宮城)"]
["仙台ビューティーアート専門学校","H104391020070","04(宮城)"]
["独立行政法人国立病院機構仙台医療センター附属仙台看護助産学校","H104391020089","04(宮城)"]
["仙台農業テック＆カフェ・パティシエ専門学校","H104391020098","04(宮城)"]
["仙台スイーツアンドカフェ専門学校","H104391020105","04(宮城)"]
["仙台ウェディングアンドブライダル専門学校","H104391020114","04(宮城)"]
["仙台ＥＣＯ動物海洋専門学校","H104391020123","04(宮城)"]
["東北芸術高等専修学校","H104391020132","04(宮城)"]
["東北愛犬専門学校","H104391020141","04(宮城)"]
["仙台歯科技工士専門学校","H104391030014","04(宮城)"]
["専門学校日本デザイナー芸術学院","H104391030023","04(宮城)"]
["仙台医健・スポーツ専門学校","H104391030032","04(宮城)"]
["仙台こども専門学校","H104391030041","04(宮城)"]
["葵会仙台看護専門学校","H104391030050","04(宮城)"]
["仙台デザイン＆テクノロジー専門学校","H104391030069","04(宮城)"]
["仙台スクールオブミュージック＆ダンス専門学校","H104391030078","04(宮城)"]
["東北歯科技工専門学校","H104391040012","04(宮城)"]
["仙台理容美容専門学校","H104391040021","04(宮城)"]
["東日本医療専門学校","H104391040030","04(宮城)"]
["仙台徳洲看護専門学校","H104391040049","04(宮城)"]
["仙台保健福祉専門学校","H104391050019","04(宮城)"]
["仙台リハビリテーション専門学校","H104391050028","04(宮城)"]
["専門学校東北動物看護学院","H104391050037","04(宮城)"]
["仙台市医師会看護専門学校","H104391050046","04(宮城)"]
["石巻赤十字看護専門学校","H104392020014","04(宮城)"]
["塩釜洋和裁専門学校","H104392030012","04(宮城)"]
["東北福祉情報専門学校","H104392050017","04(宮城)"]
["気仙沼リアス調理製菓専門学校","H104392050026","04(宮城)"]
["東日本航空専門学校","H104392110015","04(宮城)"]
["佐沼ファッション専門学校","H104392120013","04(宮城)"]
["秋田公立美術大学附属高等学院","H105220100019","05(秋田)"]
["秋田県立衛生看護学院","H105220300026","05(秋田)"]
["秋田情報ビジネス専門学校","H105320100026","05(秋田)"]
["秋田社会福祉専門学校","H105320100035","05(秋田)"]
["秋田県理容美容専門学校","H105320100044","05(秋田)"]
["秋田予備校","H105320100053","05(秋田)"]
["秋田リハビリテーション学院","H105320100062","05(秋田)"]
["秋田コアビジネスカレッジ","H105320100071","05(秋田)"]
["秋田ヘアビューティカレッジ","H105320100115","05(秋田)"]
["中通高等看護学院","H105320100124","05(秋田)"]
["秋田市医師会立秋田看護学校","H105320100133","05(秋田)"]
["秋田県歯科医療専門学校","H105320100142","05(秋田)"]
["石塚洋裁専門学校","H105320100160","05(秋田)"]
["高等専修学校秋田クラーク高等学院","H105320100179","05(秋田)"]
["秋田しらかみ看護学院","H105320200105","05(秋田)"]
["由利本荘医師会立由利本荘看護学校","H105321000150","05(秋田)"]
["山形市立病院済生館高等看護学院","H106220170013","06(山形)"]
["鶴岡市立荘内看護専門学校","H106220370011","06(山形)"]
["酒田市立酒田看護専門学校","H106220470010","06(山形)"]
["山形県立農林大学校","H106220570019","06(山形)"]
["山形デザイン専門学校","H106320171010","06(山形)"]
["山形歯科専門学校","H106320171029","06(山形)"]
["山形調理師専門学校","H106320171038","06(山形)"]
["山形美容専門学校","H106320171047","06(山形)"]
["専門学校山形Ｖ．カレッジ","H106320171056","06(山形)"]
["山形厚生看護学校","H106320171074","06(山形)"]
["山形医療技術専門学校","H106320171083","06(山形)"]
["独立行政法人国立病院機構山形病院附属看護学校","H106320171092","06(山形)"]
["明徳福祉専門学校","H106320171109","06(山形)"]
["大原簿記情報ビジネス医療福祉専門学校山形校","H106320171118","06(山形)"]
["大原スポーツ公務員専門学校山形校","H106320171127","06(山形)"]
["三友堂看護専門学校","H106320271019","06(山形)"]
["酒田調理師専門学校","H106320471017","06(山形)"]
["山形科学技術専門学校","H106320471026","06(山形)"]
["新庄コアカレッジ","H106320571025","06(山形)"]
["白鷹高等専修学校","H106340271017","06(山形)"]
["福島県立総合衛生学院","H107220180010","07(福島)"]
["いわき市医療センター看護専門学校","H107220480017","07(福島)"]
["公立岩瀬病院附属高等看護学院","H107220780014","07(福島)"]
["相馬看護専門学校","H107220981011","07(福島)"]
["福島県農業総合センター農業短期大学校","H107246680010","07(福島)"]
["大原看護専門学校","H107320181026","07(福島)"]
["尚志学園専修学校","H107320181035","07(福島)"]
["有朋高等学院","H107320181044","07(福島)"]
["フィジカルムーブメント専門学校","H107320181053","07(福島)"]
["福島看護専門学校","H107320181062","07(福島)"]
["福島県高等理容美容学院","H107320181071","07(福島)"]
["会津服装専門学校","H107320281016","07(福島)"]
["シークドレスメーカー専門学校","H107320281025","07(福島)"]
["竹田看護専門学校","H107320281034","07(福島)"]
["ＡＩＺＵビューティーカレッジ","H107320281043","07(福島)"]
["仁愛看護福祉専門学校","H107320281052","07(福島)"]
["会津若松医師会附属会津准看護高等専修学校","H107320281061","07(福島)"]
["専修学校城南スクール","H107320281070","07(福島)"]
["学校法人今泉学園今泉女子専門学校","H107320381015","07(福島)"]
["ケイセンビジネス公務員カレッジ","H107320381024","07(福島)"]
["基世学園実務専門学校","H107320381033","07(福島)"]
["東北歯科専門学校","H107320381042","07(福島)"]
["ポラリス保健看護学院","H107320381051","07(福島)"]
["太田看護専門学校","H107320381060","07(福島)"]
["社団法人郡山医師会郡山看護専門学校","H107320381079","07(福島)"]
["学校法人国際総合学園国際ビジネス公務員大学校","H107320381088","07(福島)"]
["テキサスＡ＆Ｍユニバーシティ郡山校","H107320381097","07(福島)"]
["日本調理技術専門学校","H107320381104","07(福島)"]
["東都国際ビジネス専門学校","H107320381113","07(福島)"]
["ｉキャリア医療福祉専門学校","H107320381122","07(福島)"]
["郡山健康科学専門学校","H107320381131","07(福島)"]
["学校法人国際総合学園国際アート＆デザイン大学校","H107320381140","07(福島)"]
["学校法人福寿会福島医療専門学校","H107320381159","07(福島)"]
["学校法人国際総合学園国際情報工科自動車大学校","H107320381168","07(福島)"]
["学校法人国際総合学園国際医療看護福祉大学校","H107320381177","07(福島)"]
["学校法人国際総合学園国際ビューティ＆フード大学校","H107320381186","07(福島)"]
["郡山学院高等専修学校","H107320381195","07(福島)"]
["郡山ヘアメイクカレッジ","H107320381202","07(福島)"]
["磐城学芸専門学校","H107320481014","07(福島)"]
["いわき文化服飾専門学校","H107320481023","07(福島)"]
["磐城高等芸術商科総合学園","H107320481032","07(福島)"]
["いわき和裁専修学校","H107320481041","07(福島)"]
["松村看護専門学校","H107320481050","07(福島)"]
["ｉｗａｋｉヘアメイクアカデミー","H107320481069","07(福島)"]
["福島県厚生農業協同組合連合会白河厚生総合病院付属高等看護学院","H107320581013","07(福島)"]
["白河医師会白河准看護学院","H107320581022","07(福島)"]
["しらかわ介護福祉専門学校","H107320581031","07(福島)"]
["須賀川専門学校","H107320781011","07(福島)"]
["喜多方医師会附属喜多方准看護高等専修学校","H107320881010","07(福島)"]
["福島介護福祉専門学校","H107321081016","07(福島)"]
["掛田服装専門学校","H107321381013","07(福島)"]
["福島県理工専門学校","H107352181010","07(福島)"]
["茨城県立中央看護専門学校","H108221600019","08(茨城)"]
["茨城県立つくば看護専門学校","H108222000013","08(茨城)"]
["茨城県立農業大学校","H108230200014","08(茨城)"]
["専門学校文化デザイナー学院","H108320100014","08(茨城)"]
["茨城歯科専門学校","H108320100023","08(茨城)"]
["中川学園調理技術専門学校","H108320100032","08(茨城)"]
["水戸美容専門学校","H108320100041","08(茨城)"]
["茨城県理容生活衛生同業組合立茨城県中央理容美容専門学校","H108320100050","08(茨城)"]
["水戸経理専門学校","H108320100069","08(茨城)"]
["茨城音楽専門学校","H108320100078","08(茨城)"]
["リリーこども＆スポーツ専門学校","H108320100087","08(茨城)"]
["水戸日建工科専門学校","H108320100096","08(茨城)"]
["水戸電子専門学校","H108320100103","08(茨城)"]
["水戸市医師会看護専門学院","H108320100112","08(茨城)"]
["専門学校水戸自動車大学校","H108320100121","08(茨城)"]
["専門学校水戸ビューティカレッジ","H108320100130","08(茨城)"]
["医療専門学校水戸メディカルカレッジ","H108320100149","08(茨城)"]
["水戸看護福祉専門学校","H108320100158","08(茨城)"]
["学校法人大原学園大原簿記情報公務員専門学校水戸校","H108320100167","08(茨城)"]
["学校法人大原学園大原医療ホテル観光専門学校水戸校","H108320100176","08(茨城)"]
["専修学校河合塾水戸校","H108320100185","08(茨城)"]
["駿優国際医療ビジネス専門学校","H108320100194","08(茨城)"]
["日本農業実践学園","H108320100201","08(茨城)"]
["鯉淵学園農業栄養専門学校","H108320100210","08(茨城)"]
["いばらき中央福祉専門学校","H108320100229","08(茨城)"]
["アジア動物ペットスタイリスト専門学校","H108320100238","08(茨城)"]
["白土ドレスメーカー専門学校","H108320200013","08(茨城)"]
["日立高等技芸専門学校","H108320200022","08(茨城)"]
["日立工業専修学校","H108320200031","08(茨城)"]
["日立メディカルセンター看護専門学校","H108320200040","08(茨城)"]
["筑波保育医療専門学校","H108320300012","08(茨城)"]
["竹岸食肉専門学校","H108320300021","08(茨城)"]
["筑波研究学園専門学校","H108320300049","08(茨城)"]
["土浦協同病院附属看護専門学校","H108320300058","08(茨城)"]
["アール医療福祉専門学校","H108320300067","08(茨城)"]
["学校法人桜水会土浦看護専門学校","H108320300076","08(茨城)"]
["ＡＯＩ国際福祉専門学校","H108320300085","08(茨城)"]
["東日本情報専門学校","H108320300094","08(茨城)"]
["つくばアジア福祉専門学校","H108320300101","08(茨城)"]
["いばらきどうぶつ専門学校","H108320300110","08(茨城)"]
["晃陽看護栄養専門学校","H108320400011","08(茨城)"]
["盈科美容専門学校","H108320400020","08(茨城)"]
["専門学校ＥＩＫＡ　Ｉｎｔｅｒｎａｔｉｏｎａｌ　Ｃｏｌｌｅｇｅ","H108320400039","08(茨城)"]
["古河テクノビジネス専門学校","H108320400048","08(茨城)"]
["茨城理容美容専門学校","H108320500010","08(茨城)"]
["アジア動物専門学校","H108320500029","08(茨城)"]
["アジア動物看護理学療法専門学校","H108320500038","08(茨城)"]
["茨城県結城看護専門学校","H108320700018","08(茨城)"]
["茨城県きぬ看護専門学校","H108321100012","08(茨城)"]
["やよいファッション専修学校","H108321700016","08(茨城)"]
["学校法人朝日学園成田国際航空専門学校","H108321700025","08(茨城)"]
["東海学院文化教養専門学校","H108321700034","08(茨城)"]
["取手歯科衛生専門学校","H108321700043","08(茨城)"]
["つくば栄養医療調理製菓専門学校","H108321900014","08(茨城)"]
["筑波学園看護専門学校","H108322000011","08(茨城)"]
["つくばビジネスカレッジ専門学校","H108322000020","08(茨城)"]
["筑波医療福祉専門学校","H108322000039","08(茨城)"]
["専門学校つくば自動車大学校","H108322000048","08(茨城)"]
["つくば国際ペット専門学校","H108322000057","08(茨城)"]
["茨城北西看護専門学校","H108322500016","08(茨城)"]
["細谷高等専修学校","H108322700014","08(茨城)"]
["つくば歯科福祉専門学校","H108322700023","08(茨城)"]
["宮本看護専門学校","H108322900012","08(茨城)"]
["白十字看護専門学校","H108323200017","08(茨城)"]
["東京医科大学霞ヶ浦看護専門学校","H108344300012","08(茨城)"]
["日本グローバルビジネス専門学校","H108356400015","08(茨城)"]
["栃木県立衛生福祉大学校","H109210000017","09(栃木)"]
["栃木県農業大学校","H109210000026","09(栃木)"]
["栃木県県南高等看護専門学院","H109210000035","09(栃木)"]
["宇都宮アートアンドスポーツ専門学校","H109310000015","09(栃木)"]
["国際看護介護保育専門学校","H109310000024","09(栃木)"]
["インターナショナルビジネスランゲージ専門学校","H109310000033","09(栃木)"]
["足利デザイン・ビューティ専門学校","H109310000042","09(栃木)"]
["石山和装専門学校","H109310000060","09(栃木)"]
["和氣和裁専門学校","H109310000079","09(栃木)"]
["明美和装専門学校","H109310000088","09(栃木)"]
["専門学校Ｔｏｃｈｉｇｉ　Ｇｌｏｂａｌ　Ｆａｓｈｉｏｎ　Ｂｕｓｉｎｅｓｓ　Ｃｏｌｌｅｇｅ","H109310000097","09(栃木)"]
["済生会宇都宮病院看護専門学校","H109310000104","09(栃木)"]
["獨協医科大学附属看護専門学校","H109310000113","09(栃木)"]
["宇都宮歯科衛生士専門学校","H109310000122","09(栃木)"]
["宇都宮市医療保健事業団附属宇都宮准看護高等専修学校","H109310000131","09(栃木)"]
["栃木介護福祉士専門学校","H109310000140","09(栃木)"]
["中央福祉医療専門学校","H109310000159","09(栃木)"]
["国際医療福祉大学塩谷看護専門学校","H109310000168","09(栃木)"]
["マロニエ医療福祉専門学校","H109310000177","09(栃木)"]
["さくら総合専門学校","H109310000186","09(栃木)"]
["足利製菓専門学校","H109310000195","09(栃木)"]
["（独）国立病院機構栃木医療センター附属看護学校","H109310000202","09(栃木)"]
["報徳看護専門学校","H109310000211","09(栃木)"]
["専門学校足利コミュニティーカレッジ","H109310000220","09(栃木)"]
["ヤマトファッションビジネス専門学校","H109310000239","09(栃木)"]
["アイ・エフ・シー大学校","H109310000248","09(栃木)"]
["国際ＴＢＣ調理・パティシエ専門学校","H109310000257","09(栃木)"]
["アイ・エフ・シー栄養専門学校","H109310000266","09(栃木)"]
["宇都宮美容専門学校","H109310000284","09(栃木)"]
["栃木県美容専門学校","H109310000293","09(栃木)"]
["国際ファッションビューティ専門学校","H109310000300","09(栃木)"]
["センスビューティーカレッジ","H109310000319","09(栃木)"]
["国際テクニカル美容専門学校","H109310000328","09(栃木)"]
["アジア農村指導者養成専門学校","H109310000337","09(栃木)"]
["宇都宮メディア・アーツ専門学校","H109310000346","09(栃木)"]
["国際テクニカルデザイン・自動車専門学校","H109310000355","09(栃木)"]
["小山歯科衛生士専門学校","H109310000364","09(栃木)"]
["専門学校日産栃木自動車大学校","H109310000373","09(栃木)"]
["宇都宮ビジネス電子専門学校","H109310000382","09(栃木)"]
["国際情報ビジネス専門学校","H109310000391","09(栃木)"]
["国際自動車・ビューティ専門学校","H109310000408","09(栃木)"]
["オリオンＩＴ専門学校","H109310000417","09(栃木)"]
["宇都宮日建工科専門学校","H109310000426","09(栃木)"]
["専修学校宇都宮書道学校","H109310000435","09(栃木)"]
["国際ペット総合専門学校","H109310000444","09(栃木)"]
["大原簿記情報ビジネス医療専門学校宇都宮校","H109310000453","09(栃木)"]
["大原スポーツ公務員専門学校宇都宮校","H109310000462","09(栃木)"]
["国際テクニカル理容美容専門学校","H109310000471","09(栃木)"]
["国際テクニカル調理製菓専門学校","H109310000480","09(栃木)"]
["国際ＴＢＣ高等専修学校","H109310000499","09(栃木)"]
["那須看護専門学校","H109310000505","09(栃木)"]
["セントメリー外語専門学校","H109310000514","09(栃木)"]
["国際ティビィシィ小山看護専門学校","H109310000523","09(栃木)"]
["中央アートスクール","H109310000532","09(栃木)"]
["ＮＩＫＫＯ外語観光専門学校","H109310000541","09(栃木)"]
["富岡看護専門学校","H110210000014","10(群馬)"]
["館林高等看護学院","H110210000023","10(群馬)"]
["群馬県立農林大学校","H110210000032","10(群馬)"]
["白ゆりファッション専門学校","H110310000012","10(群馬)"]
["専門学校群馬自動車大学校","H110310000021","10(群馬)"]
["大泉保育福祉専門学校","H110310000030","10(群馬)"]
["前橋文化服装専門学校","H110310000049","10(群馬)"]
["群馬調理師専門学校","H110310000058","10(群馬)"]
["群馬県高等歯科衛生士学院","H110310000067","10(群馬)"]
["群馬法科ビジネス専門学校","H110310000076","10(群馬)"]
["群馬県理容専門学校","H110310000085","10(群馬)"]
["群馬県美容専門学校","H110310000094","10(群馬)"]
["東日本ブライダル・ホテル・トラベル専門学校","H110310000101","10(群馬)"]
["東日本デザイン＆コンピュータ専門学校","H110310000110","10(群馬)"]
["中央スポーツ医療専門学校","H110310000129","10(群馬)"]
["中央情報経理専門学校","H110310000138","10(群馬)"]
["群馬社会福祉専門学校","H110310000147","10(群馬)"]
["群馬日建工科専門学校","H110310000156","10(群馬)"]
["群ゼミＡＬＥＸ外語専門学校","H110310000165","10(群馬)"]
["東日本調理師専門学校","H110310000174","10(群馬)"]
["高崎調理師専門学校","H110310000192","10(群馬)"]
["高崎スクールオブビジネス","H110310000209","10(群馬)"]
["高崎コンピュータ専門学校","H110310000218","10(群馬)"]
["高崎歯科衛生専門学校","H110310000227","10(群馬)"]
["前橋医療福祉専門学校","H110310000236","10(群馬)"]
["専門学校中央情報大学校","H110310000245","10(群馬)"]
["東日本製菓技術専門学校","H110310000254","10(群馬)"]
["高崎ビューティモード専門学校","H110310000263","10(群馬)"]
["高崎動物専門学校","H110310000272","10(群馬)"]
["独立行政法人国立病院機構高崎総合医療センター附属高崎看護学校","H110310000281","10(群馬)"]
["群馬法科ビジネス専門学校桐生校","H110310000290","10(群馬)"]
["伊勢崎美容専門学校","H110310000307","10(群馬)"]
["一般社団法人伊勢崎佐波医師会立伊勢崎敬愛看護学院","H110310000316","10(群馬)"]
["東群馬看護専門学校","H110310000334","10(群馬)"]
["太田情報商科専門学校","H110310000343","10(群馬)"]
["ＳＵＢＡＲＵ健康保険組合太田高等看護学院","H110310000352","10(群馬)"]
["中央医療歯科専門学校","H110310000361","10(群馬)"]
["太田医療技術専門学校","H110310000370","10(群馬)"]
["太田動物専門学校","H110310000389","10(群馬)"]
["富岡文化服装専門学校","H110310000398","10(群馬)"]
["渋川看護専門学校","H110310000405","10(群馬)"]
["前橋東看護学校","H110310000414","10(群馬)"]
["フェリカ家づくり専門学校","H110310000423","10(群馬)"]
["東日本栄養医薬専門学校","H110310000441","10(群馬)"]
["群馬パース大学福祉専門学校","H110310000450","10(群馬)"]
["中央動物看護専門学校","H110310000469","10(群馬)"]
["専門学校太田自動車大学校","H110310000478","10(群馬)"]
["育英メディカル専門学校","H110310000487","10(群馬)"]
["群馬動物専門学校","H110310000496","10(群馬)"]
["桐生市医師会立桐生高等看護学院","H110310000502","10(群馬)"]
["専門学校高崎福祉医療カレッジ","H110310000511","10(群馬)"]
["高崎市医師会看護専門学校","H110310000520","10(群馬)"]
["ウェディング・ホテル＆ツーリズム専門学校","H110310000539","10(群馬)"]
["専門学校中央農業大学校","H110310000548","10(群馬)"]
["大原簿記情報ビジネス医療福祉保育専門学校","H110310000557","10(群馬)"]
["大原スポーツ公務員専門学校高崎校","H110310000566","10(群馬)"]
["ＮＩＰＰＯＮおもてなし専門学校","H110310000575","10(群馬)"]
["中央高等専修学校前橋校","H110310000584","10(群馬)"]
["中央高等専修学校桐生校","H110310000593","10(群馬)"]
["前橋市医師会立前橋高等看護学院","H110310000600","10(群馬)"]
["たかさき・ナイチンゲール学院","H110310000619","10(群馬)"]
["アーツサウンドビジュアル専門学校","H110310000628","10(群馬)"]
["国際産業技術専門学校","H110310000637","10(群馬)"]
["中央医療歯科専門学校高崎校","H110310000646","10(群馬)"]
["ＮＩＰＰＯＮおもてなし専門学校東京デュアラー校","H110310000655","10(群馬)"]
["ＮＩＰＰＯＮアントレプレナー専門学校","H110310000664","10(群馬)"]
["蒼羽藝術高等専修学校","H110310000673","10(群馬)"]
["太田工科専門学校","H110310000682","10(群馬)"]
["国立障害者リハビリテーションセンター","H111110000015","11(埼玉)"]
["国立障害者リハビリテーションセンター学院","H111110000024","11(埼玉)"]
["さいたま市立高等看護学院","H111210900014","11(埼玉)"]
["埼玉県立高等看護学院","H111220200010","11(埼玉)"]
["埼玉県農業大学校","H111220200029","11(埼玉)"]
["川口市立看護専門学校","H111220300019","11(埼玉)"]
["春日部市立看護専門学校","H111221400016","11(埼玉)"]
["埼玉動物海洋専門学校","H111310300018","11(埼玉)"]
["埼玉コンピュータ＆医療事務専門学校","H111310300027","11(埼玉)"]
["駿台予備学校大宮校","H111310300036","11(埼玉)"]
["大宮歯科衛生士専門学校","H111310300045","11(埼玉)"]
["大宮医師会看護専門学校","H111310300054","11(埼玉)"]
["大原簿記情報ビジネス専門学校大宮校","H111310300063","11(埼玉)"]
["専修学校河合塾大宮校","H111310300072","11(埼玉)"]
["埼玉福祉保育医療専門学校","H111310300081","11(埼玉)"]
["大原法律公務員専門学校大宮校","H111310300090","11(埼玉)"]
["大宮国際動物専門学校","H111310300107","11(埼玉)"]
["東京ＩＴ会計法律専門学校大宮校","H111310300116","11(埼玉)"]
["大宮理容美容専門学校","H111310300125","11(埼玉)"]
["大原医療秘書福祉専門学校大宮校","H111310300134","11(埼玉)"]
["呉竹医療専門学校","H111310300143","11(埼玉)"]
["埼玉ベルエポック製菓調理専門学校","H111310300152","11(埼玉)"]
["大宮スイーツアンドカフェ専門学校","H111310300161","11(埼玉)"]
["大宮ビューティーアンドブライダル専門学校","H111310300170","11(埼玉)"]
["大宮医療秘書専門学校","H111310300189","11(埼玉)"]
["ミス・パリ・ビューティ専門学校大宮校","H111310300198","11(埼玉)"]
["大宮こども専門学校","H111310300205","11(埼玉)"]
["大原こども専門学校","H111310300214","11(埼玉)"]
["埼玉歯科技工士専門学校","H111310400017","11(埼玉)"]
["新洋国際専門学校","H111310400026","11(埼玉)"]
["国際医療専門学校","H111310600015","11(埼玉)"]
["さいたま柔整専門学校","H111310700014","11(埼玉)"]
["内外家政専門学校","H111310700023","11(埼玉)"]
["埼玉県理容美容専門学校","H111310700032","11(埼玉)"]
["浦和専門学校","H111310700041","11(埼玉)"]
["浦和美術専門学校・高等専修学校","H111310900012","11(埼玉)"]
["さいたま看護専門学校","H111310900021","11(埼玉)"]
["早稲田医療技術専門学校","H111311000028","11(埼玉)"]
["専門学校トータルビューティカレッジ川越","H111320100019","11(埼玉)"]
["埼玉医科大学附属総合医療センター看護専門学校","H111320100028","11(埼玉)"]
["国際情報経済専門学校","H111320100037","11(埼玉)"]
["川越市医師会川越看護専門学校","H111320100046","11(埼玉)"]
["医学アカデミー","H111320100055","11(埼玉)"]
["東京国際学園外語専門学校","H111320100064","11(埼玉)"]
["埼玉県栄養専門学校","H111320200018","11(埼玉)"]
["熊谷文化服装専門学校","H111320200027","11(埼玉)"]
["熊谷外国語専門学校","H111320200036","11(埼玉)"]
["熊谷市医師会看護専門学校","H111320200045","11(埼玉)"]
["埼玉県調理師専門学校","H111320200054","11(埼玉)"]
["アルスコンピュータ専門学校","H111320200063","11(埼玉)"]
["埼玉県製菓専門学校","H111320200072","11(埼玉)"]
["日本産業専門学校","H111320300017","11(埼玉)"]
["川口文化服装専門学校","H111320300026","11(埼玉)"]
["済生会川口看護専門学校","H111320300035","11(埼玉)"]
["大橋医療高等専修学校","H111320300044","11(埼玉)"]
["テクノ・ホルティ園芸専門学校","H111320600014","11(埼玉)"]
["秩父家政専門学校","H111320700013","11(埼玉)"]
["秩父看護専門学校","H111320700022","11(埼玉)"]
["専門学校浜西ファッションアカデミー","H111320800012","11(埼玉)"]
["西武学園医学技術専門学校","H111320800021","11(埼玉)"]
["国際航空専門学校","H111320800030","11(埼玉)"]
["早稲田ゼミナール所沢校","H111320800049","11(埼玉)"]
["秋草学園福祉教育専門学校","H111320800058","11(埼玉)"]
["所沢看護専門学校","H111320800067","11(埼玉)"]
["国立病院機構西埼玉中央病院附属看護学校","H111320800076","11(埼玉)"]
["コロンビアインターナショナルスクール","H111320800085","11(埼玉)"]
["西武調理師アート専門学校","H111320800094","11(埼玉)"]
["大川学園高等専修学校","H111320900011","11(埼玉)"]
["飯能看護専門学校","H111320900020","11(埼玉)"]
["大川学園医療福祉専門学校","H111320900039","11(埼玉)"]
["本庄情報ビジネス専門学校","H111321100017","11(埼玉)"]
["専門学校関東工業自動車大学校","H111321700011","11(埼玉)"]
["関東福祉専門学校","H111321700020","11(埼玉)"]
["深谷大里看護専門学校","H111321800010","11(埼玉)"]
["葵メディカルアカデミー","H111321800029","11(埼玉)"]
["上尾中央看護専門学校","H111321900019","11(埼玉)"]
["埼玉歯科衛生専門学校","H111321900028","11(埼玉)"]
["上尾市医師会上尾看護専門学校","H111321900037","11(埼玉)"]
["埼玉医療福祉専門学校","H111321900046","11(埼玉)"]
["上尾中央医療専門学校","H111321900055","11(埼玉)"]
["越谷保育専門学校","H111322200014","11(埼玉)"]
["専門学校日本医科学大学校","H111322200023","11(埼玉)"]
["ＣＡＤ製図専門学校","H111322200032","11(埼玉)"]
["専門学校東萌ビューティーカレッジ","H111322200041","11(埼玉)"]
["戸田中央看護専門学校","H111322400012","11(埼玉)"]
["蕨戸田市医師会看護専門学校","H111322400021","11(埼玉)"]
["入間看護専門学校","H111322500011","11(埼玉)"]
["朝霞地区看護専門学校","H111322900017","11(埼玉)"]
["中央情報専門学校","H111323000014","11(埼玉)"]
["南埼玉郡市医師会久喜看護専門学校","H111323200012","11(埼玉)"]
["北里大学看護専門学校","H111323300011","11(埼玉)"]
["獨協医科大学附属看護専門学校三郷校","H111323700017","11(埼玉)"]
["坂戸鶴ヶ島医師会立看護専門学校","H111323900015","11(埼玉)"]
["日本グローバル専門学校","H111323900024","11(埼玉)"]
["山手ビジネスカレッジ","H111323900033","11(埼玉)"]
["幸手看護専門学校","H111324000012","11(埼玉)"]
["吉川福祉専門学校","H111324300019","11(埼玉)"]
["ホンダテクニカルカレッジ関東","H111324500026","11(埼玉)"]
["上福岡高等看護学院","H111324500035","11(埼玉)"]
["専門学校埼玉自動車大学校","H111330100018","11(埼玉)"]
["埼玉医療福祉会看護専門学校","H111332600019","11(埼玉)"]
["専門学校越生自動車大学校","H111332700018","11(埼玉)"]
["グルノーブル美容専門学校","H111338300019","11(埼玉)"]
["かんな福祉専門学校","H111338300028","11(埼玉)"]
["本庄児玉看護専門学校","H111338500017","11(埼玉)"]
["君津中央病院附属看護学校","H112210000012","12(千葉)"]
["松戸市立総合医療センター附属看護専門学校","H112210000021","12(千葉)"]
["船橋市立看護専門学校","H112210000030","12(千葉)"]
["千葉県立鶴舞看護専門学校","H112210000049","12(千葉)"]
["千葉県立野田看護専門学校","H112210000058","12(千葉)"]
["千葉県立農業大学校","H112210000076","12(千葉)"]
["地方独立行政法人総合病院国保旭中央病院旭中央病院附属看護専門学校","H112310000010","12(千葉)"]
["国際トラベル・ホテル・ブライダル専門学校","H112310000029","12(千葉)"]
["千葉女子専門学校","H112310000038","12(千葉)"]
["東洋理容美容専門学校","H112310000047","12(千葉)"]
["千葉情報経理専門学校","H112310000056","12(千葉)"]
["イーストウエスト外国語専門学校","H112310000065","12(千葉)"]
["千葉モードビジネス専門学校","H112310000074","12(千葉)"]
["関東鍼灸専門学校","H112310000083","12(千葉)"]
["専門学校千葉県自動車大学校","H112310000092","12(千葉)"]
["組合立千葉美容専門学校","H112310000118","12(千葉)"]
["パリ総合美容専門学校千葉校","H112310000127","12(千葉)"]
["千葉調理師専門学校","H112310000136","12(千葉)"]
["千葉中央看護専門学校","H112310000145","12(千葉)"]
["専修学校河合塾津田沼校","H112310000154","12(千葉)"]
["専門学校国際理工カレッジ","H112310000163","12(千葉)"]
["山王看護専門学校","H112310000172","12(千葉)"]
["千葉日建工科専門学校","H112310000181","12(千葉)"]
["上野法科ビジネス専門学校","H112310000190","12(千葉)"]
["国際医療福祉専門学校","H112310000207","12(千葉)"]
["中央介護福祉専門学校","H112310000216","12(千葉)"]
["専門学校ちば愛犬動物フラワー学園","H112310000225","12(千葉)"]
["京葉介護福祉専門学校","H112310000234","12(千葉)"]
["独立行政法人国立病院機構千葉医療センター附属千葉看護学校","H112310000243","12(千葉)"]
["東京ＩＴ会計公務員専門学校千葉校","H112310000252","12(千葉)"]
["千葉デザイナー学院","H112310000261","12(千葉)"]
["千葉市青葉看護専門学校","H112310000270","12(千葉)"]
["アイエステティック専門学校","H112310000289","12(千葉)"]
["千葉医療秘書専門学校","H112310000298","12(千葉)"]
["千葉リゾートアンドスポーツ専門学校","H112310000305","12(千葉)"]
["千葉ビューティーアンドブライダル専門学校","H112310000314","12(千葉)"]
["大原医療保育福祉専門学校千葉校","H112310000323","12(千葉)"]
["大原簿記公務員専門学校千葉校","H112310000332","12(千葉)"]
["ハッピー製菓調理専門学校","H112310000341","12(千葉)"]
["ジェイヘアメイク美容専門学校","H112310000350","12(千葉)"]
["千葉こども専門学校","H112310000369","12(千葉)"]
["北原学院千葉歯科衛生専門学校","H112310000387","12(千葉)"]
["船橋ファッション＆ビジネス専門学校","H112310000403","12(千葉)"]
["船橋情報ビジネス専門学校","H112310000412","12(千葉)"]
["日医電専門学校","H112310000421","12(千葉)"]
["専修学校早稲田予備学校西船橋校","H112310000430","12(千葉)"]
["ユニバーサルビューティーカレッジ","H112310000449","12(千葉)"]
["木更津看護学院","H112310000458","12(千葉)"]
["日本大学松戸歯学部附属歯科衛生専門学校","H112310000467","12(千葉)"]
["北原学院歯科衛生専門学校","H112310000476","12(千葉)"]
["日本国際工科専門学校","H112310000485","12(千葉)"]
["専門学校ニホン国際ＩＴカレッジ","H112310000494","12(千葉)"]
["松山学園松山福祉専門学校","H112310000500","12(千葉)"]
["野田鎌田学園高等専修学校","H112310000519","12(千葉)"]
["正心実業専門学校","H112310000528","12(千葉)"]
["成田国際福祉専門学校","H112310000537","12(千葉)"]
["二葉看護学院","H112310000546","12(千葉)"]
["専門学校藤リハビリテーション学院","H112310000555","12(千葉)"]
["成田航空ビジネス専門学校","H112310000564","12(千葉)"]
["旭家政専修学校","H112310000582","12(千葉)"]
["習志野調理師専門学校","H112310000591","12(千葉)"]
["千葉薬事専門学校","H112310000608","12(千葉)"]
["大原簿記公務員医療情報ビジネス専門学校津田沼校","H112310000617","12(千葉)"]
["駿台予備学校津田沼校","H112310000626","12(千葉)"]
["慈恵柏看護専門学校","H112310000635","12(千葉)"]
["大原簿記法律専門学校柏校","H112310000644","12(千葉)"]
["パリ総合美容専門学校柏校","H112310000653","12(千葉)"]
["専修学校河合塾柏校","H112310000662","12(千葉)"]
["独立行政法人労働者健康安全機構千葉労災看護専門学校","H112310000680","12(千葉)"]
["市原看護専門学校","H112310000699","12(千葉)"]
["江戸川学園おおたかの森専門学校","H112310000706","12(千葉)"]
["勤医会東葛看護専門学校","H112310000715","12(千葉)"]
["東京動物専門学校","H112310000724","12(千葉)"]
["八千代リハビリテーション学院","H112310000733","12(千葉)"]
["あびこ助産師専門学校","H112310000742","12(千葉)"]
["スカイ総合ペット専門学校","H112310000751","12(千葉)"]
["亀田医療技術専門学校","H112310000760","12(千葉)"]
["白萩服飾専修学院","H112310000779","12(千葉)"]
["専門学校新国際福祉カレッジ","H112310000788","12(千葉)"]
["日本医科大学看護専門学校","H112310000797","12(千葉)"]
["（専）中央自動車大学校","H112310000804","12(千葉)"]
["千葉・柏リハビリテーション学院","H112310000813","12(千葉)"]
["葵会柏看護専門学校","H112310000822","12(千葉)"]
["駿台予備学校柏校","H112310000831","12(千葉)"]
["東和ＩＴ専門学校","H112310000840","12(千葉)"]
["専門学校三育学院カレッジ","H112310000859","12(千葉)"]
["専門学校日本自動車大学校袖ケ浦校","H112310000868","12(千葉)"]
["専門学校日本自動車大学校","H112310000877","12(千葉)"]
["千葉医療福祉専門学校","H112310000886","12(千葉)"]
["安房医療福祉専門学校","H112310000895","12(千葉)"]
["専門学校マーキュリー情報コミュニケーションカレッジ","H112310000902","12(千葉)"]
["香取おみがわ医療センター附属看護専門学校","H112310000911","12(千葉)"]
["国立療養所多磨全生園附属看護学校","H113110000013","13(東京)"]
["東京都立荏原看護専門学校","H113211100018","13(東京)"]
["東京都立広尾看護専門学校","H113211300016","13(東京)"]
["東京都立板橋看護専門学校","H113211900010","13(東京)"]
["八王子市立看護専門学校","H113220100019","13(東京)"]
["東京都立青梅看護専門学校","H113220500015","13(東京)"]
["東京都立府中看護専門学校","H113220600014","13(東京)"]
["東京都立北多摩看護専門学校","H113222000016","13(東京)"]
["東京都立南多摩看護専門学校","H113222400012","13(東京)"]
["大原簿記学校","H113310100018","13(東京)"]
["専門学校お茶の水スクール・オブ・ビジネス","H113310100027","13(東京)"]
["専門学校神田外語学院","H113310100036","13(東京)"]
["専門学校ファッションカレッジ桜丘","H113310100045","13(東京)"]
["駿台電子情報アンドビジネス専門学校","H113310100054","13(東京)"]
["上智社会福祉専門学校","H113310100063","13(東京)"]
["大原医療秘書福祉保育専門学校","H113310100072","13(東京)"]
["東京デザイナー学院","H113310100081","13(東京)"]
["専門学校東京ビジュアルアーツ","H113310100090","13(東京)"]
["東京ホテル・トラベル学院専門学校","H113310100107","13(東京)"]
["東京アニメーター学院専門学校","H113310100116","13(東京)"]
["日本大学歯学部附属歯科技工専門学校","H113310100125","13(東京)"]
["日本大学歯学部附属歯科衛生専門学校","H113310100134","13(東京)"]
["山脇美術専門学校","H113310100143","13(東京)"]
["専門学校アテネ・フランセ","H113310100152","13(東京)"]
["御茶の水美術専門学校","H113310100161","13(東京)"]
["駿台外語アンドビジネス専門学校","H113310100170","13(東京)"]
["東京情報クリエイター工学院専門学校","H113310100189","13(東京)"]
["専修学校河合塾麹町校","H113310100198","13(東京)"]
["東京理容専修学校","H113310100205","13(東京)"]
["駿台予備学校","H113310100214","13(東京)"]
["東京商科・法科学院専門学校","H113310100241","13(東京)"]
["日本ウェルネス保育専門学校","H113310100250","13(東京)"]
["大原法律専門学校","H113310100278","13(東京)"]
["東京テクノ・ホルティ園芸専門学校","H113310100287","13(東京)"]
["駿台法律経済アンドビジネス専門学校","H113310100296","13(東京)"]
["専門学校東京医療学院","H113310200017","13(東京)"]
["東京ファッション専門学校","H113310200026","13(東京)"]
["東京医療福祉専門学校","H113310200035","13(東京)"]
["東京英語専門学校","H113310200044","13(東京)"]
["東京学園調理師専門学校","H113310200053","13(東京)"]
["北九州予備校東京校","H113310200062","13(東京)"]
["慈恵看護専門学校","H113310300016","13(東京)"]
["聖徳大学幼児教育専門学校","H113310300025","13(東京)"]
["ハリウッド美容専門学校","H113310300034","13(東京)"]
["音響芸術専門学校","H113310300043","13(東京)"]
["順心英語ビジネス専門学校","H113310300052","13(東京)"]
["専門学校青山ファッションカレッジ","H113310300061","13(東京)"]
["タカラ美容専門学校","H113310300070","13(東京)"]
["首都医校","H113310400015","13(東京)"]
["専門学校早稲田国際ビジネスカレッジ","H113310400024","13(東京)"]
["東放学園高等専修学校","H113310400033","13(東京)"]
["東京外語専門学校","H113310400042","13(東京)"]
["高山美容専門学校","H113310400051","13(東京)"]
["中央理美容専門学校","H113310400060","13(東京)"]
["東京栄養専門学校","H113310400079","13(東京)"]
["マリールイズ美容専門学校","H113310400088","13(東京)"]
["日本医学柔整鍼灸専門学校","H113310400097","13(東京)"]
["東京医療専門学校","H113310400104","13(東京)"]
["東洋美術学校","H113310400113","13(東京)"]
["日本電子専門学校","H113310400122","13(東京)"]
["日本美容専門学校","H113310400131","13(東京)"]
["東京・ｉスマートビジネス専門学校","H113310400140","13(東京)"]
["独立行政法人地域医療機能推進機構東京山手メディカルセンター附属看護専門学校","H113310400159","13(東京)"]
["東京家政専門学校","H113310400168","13(東京)"]
["新宿医療専門学校","H113310400177","13(東京)"]
["東京調理製菓専門学校","H113310400186","13(東京)"]
["東京眼鏡専門学校","H113310400195","13(東京)"]
["ＨＡＬ東京","H113310400202","13(東京)"]
["東洋鍼灸専門学校","H113310400211","13(東京)"]
["早稲田大学芸術学校","H113310400220","13(東京)"]
["新宿調理師専門学校","H113310400239","13(東京)"]
["日本メンズアパレルアカデミー","H113310400248","13(東京)"]
["独立行政法人地域医療機能推進機構東京新宿メディカルセンター附属看護専門学校","H113310400257","13(東京)"]
["目白ファッション＆アートカレッジ","H113310400266","13(東京)"]
["ファッションビジネスカレッジ東京","H113310400275","13(東京)"]
["東京製菓学校","H113310400284","13(東京)"]
["東京ＹＭＣＡ国際ホテル専門学校","H113310400293","13(東京)"]
["専門学校東京経理綜合学院","H113310400300","13(東京)"]
["東京モード学園","H113310400319","13(東京)"]
["専門学校ミュージシャンズ・インスティテュート東京","H113310400328","13(東京)"]
["東京観光専門学校","H113310400337","13(東京)"]
["西武学園医学技術専門学校東京新宿校","H113310400346","13(東京)"]
["専修学校早稲田ゼミナール","H113310400364","13(東京)"]
["専修学校早稲田予備学校","H113310400373","13(東京)"]
["専修学校河合塾新宿校","H113310400382","13(東京)"]
["東京美容専門学校","H113310400391","13(東京)"]
["東京デザインテクノロジーセンター専門学校","H113310400408","13(東京)"]
["日本児童教育専門学校","H113310400417","13(東京)"]
["東放学園映画専門学校","H113310400426","13(東京)"]
["東京アニメーションカレッジ専門学校","H113310400435","13(東京)"]
["グレッグ外語専門学校新宿校","H113310400444","13(東京)"]
["日本福祉教育専門学校","H113310400453","13(東京)"]
["真野美容専門学校","H113310400462","13(東京)"]
["ヘレン・ケラー学院","H113310400471","13(東京)"]
["早稲田医学院歯科衛生士専門学校","H113310400480","13(東京)"]
["専門学校ＥＳＰエンタテインメント東京","H113310400499","13(東京)"]
["東京マルチ・ＡＩ専門学校","H113310400505","13(東京)"]
["早稲田外語専門学校","H113310400514","13(東京)"]
["日本フラワーデザイン専門学校","H113310400532","13(東京)"]
["早稲田美容専門学校","H113310400541","13(東京)"]
["富士国際ビジネス専門学校","H113310500014","13(東京)"]
["読売理工医療福祉専門学校","H113310500023","13(東京)"]
["東京ウェディング＆ブライダル専門学校","H113310500032","13(東京)"]
["彰栄保育福祉専門学校","H113310500041","13(東京)"]
["尚美ミュージックカレッジ専門学校","H113310500050","13(東京)"]
["竹早教員保育士養成所","H113310500069","13(東京)"]
["専修学校河合塾本郷校","H113310500078","13(東京)"]
["日本プリンティングアカデミー","H113310500087","13(東京)"]
["東京こども専門学校","H113310500096","13(東京)"]
["日本指圧専門学校","H113310500103","13(東京)"]
["日中学院","H113310500112","13(東京)"]
["東京スイーツアンドカフェ専門学校","H113310500121","13(東京)"]
["東京医療秘書福祉専門学校","H113310500130","13(東京)"]
["お茶の水はりきゅう専門学校","H113310500149","13(東京)"]
["東京リゾートアンドスポーツ専門学校","H113310500158","13(東京)"]
["東京ビューティーアート専門学校","H113310500167","13(東京)"]
["東京みらいＡＩアンドＩＴ専門学校","H113310500176","13(東京)"]
["下谷医師会立看護高等専修学校","H113310600013","13(東京)"]
["華服飾専門学校","H113310600022","13(東京)"]
["華調理製菓専門学校","H113310600031","13(東京)"]
["日本健康医療専門学校","H113310600040","13(東京)"]
["専門学校東京国際ビジネスカレッジ","H113310600059","13(東京)"]
["華学園栄養専門学校","H113310600068","13(東京)"]
["国際デュアルビジネス専門学校","H113310600077","13(東京)"]
["上野法律専門学校","H113310600086","13(東京)"]
["専門学校アニメ・アーティスト・アカデミー","H113310700012","13(東京)"]
["東京ＩＴプログラミング＆会計専門学校","H113310700021","13(東京)"]
["東京墨田看護専門学校","H113310700030","13(東京)"]
["東京医学技術専門学校","H113310700049","13(東京)"]
["東京環境工科専門学校","H113310700058","13(東京)"]
["専門学校日本動物２１","H113310700067","13(東京)"]
["東京法律公務員専門学校","H113310700076","13(東京)"]
["専門学校日本鉄道＆スポーツビジネスカレッジ２１","H113310700085","13(東京)"]
["スポーツ健康医療専門学校","H113310700094","13(東京)"]
["江東服飾高等専修学校","H113310800011","13(東京)"]
["臨床福祉専門学校","H113310800020","13(東京)"]
["東京ＹＭＣＡ社会体育・保育専門学校","H113310800039","13(東京)"]
["東京服装文化学院","H113310800048","13(東京)"]
["専門学校読売自動車大学校","H113310800057","13(東京)"]
["秀林外語専門学校","H113310800066","13(東京)"]
["東京マックス美容専門学校","H113310900010","13(東京)"]
["ドレスメーカー学院","H113310900029","13(東京)"]
["宮川文化服装専門学校","H113310900038","13(東京)"]
["日本書道専門学校","H113310900047","13(東京)"]
["昭和大学医学部附属看護専門学校","H113310900056","13(東京)"]
["池見東京医療専門学校","H113310900065","13(東京)"]
["新東京歯科技工士学校","H113310900074","13(東京)"]
["東京健康科学専門学校","H113310900083","13(東京)"]
["専門学校東京工科自動車大学校品川校","H113310900092","13(東京)"]
["品川介護福祉専門学校","H113310900109","13(東京)"]
["専門学校アイシーエスカレッジオブアーツ","H113311000017","13(東京)"]
["専門学校東都リハビリテーション学院","H113311000026","13(東京)"]
["グレッグ外語専門学校","H113311000035","13(東京)"]
["専修学校河合塾自由が丘校","H113311000044","13(東京)"]
["簡野学園羽田幼児教育専門学校","H113311100016","13(東京)"]
["佐伯栄養専門学校","H113311100025","13(東京)"]
["東京誠心調理師専門学校","H113311100034","13(東京)"]
["東京衛生学園専門学校","H113311100043","13(東京)"]
["日本芸術専門学校","H113311100052","13(東京)"]
["日本工学院専門学校","H113311100061","13(東京)"]
["すず学園高等専修学校","H113311100089","13(東京)"]
["新東京歯科衛生士学校","H113311100098","13(東京)"]
["東京バイオテクノロジー専門学校","H113311100105","13(東京)"]
["昭和医療技術専門学校","H113311100114","13(東京)"]
["東京すし和食調理専門学校","H113311200015","13(東京)"]
["ヨークグローバルビジネスアカデミー専門学校","H113311200024","13(東京)"]
["世田谷区医師会立看護高等専修学校","H113311200033","13(東京)"]
["東京栄養食糧専門学校","H113311200042","13(東京)"]
["東京ロシア語学院","H113311200051","13(東京)"]
["日本菓子専門学校","H113311200060","13(東京)"]
["世田谷中央看護高等専修学校","H113311200079","13(東京)"]
["世田谷福祉専門学校","H113311200088","13(東京)"]
["東京山手調理師専門学校","H113311200097","13(東京)"]
["専門学校東京工科自動車大学校世田谷校","H113311200104","13(東京)"]
["日本体育大学医療専門学校","H113311200113","13(東京)"]
["至誠会看護専門学校","H113311200122","13(東京)"]
["国際動物専門学校","H113311200131","13(東京)"]
["東京サイクルデザイン専門学校","H113311300014","13(東京)"]
["東京スクールオブミュージック専門学校渋谷","H113311300023","13(東京)"]
["国際英語学校","H113311300032","13(東京)"]
["専門学校清水とき・きものアカデミア","H113311300041","13(東京)"]
["専門学校桑沢デザイン研究所","H113311300050","13(東京)"]
["山手調理製菓専門学校","H113311300069","13(東京)"]
["東京デザイン専門学校","H113311300078","13(東京)"]
["専門学校東京声優・国際アカデミー","H113311300096","13(東京)"]
["渋谷ファッション＆アート専門学校","H113311300103","13(東京)"]
["日本デザイン福祉専門学校","H113311300112","13(東京)"]
["文化服装学院","H113311300121","13(東京)"]
["専門学校ミューズモード音楽院","H113311300130","13(東京)"]
["山野美容専門学校","H113311300149","13(東京)"]
["東京ダンス・俳優＆舞台芸術専門学校","H113311300158","13(東京)"]
["服部栄養専門学校","H113311300167","13(東京)"]
["専門学校日本デザイナー学院","H113311300176","13(東京)"]
["国際文化理容美容専門学校渋谷校","H113311300185","13(東京)"]
["専門学校ヒコ・みづのジュエリーカレッジ","H113311300210","13(東京)"]
["日本鍼灸理療専門学校","H113311300229","13(東京)"]
["日本柔道整復専門学校","H113311300238","13(東京)"]
["専門学校東京スクール・オブ・ビジネス","H113311300247","13(東京)"]
["文化外国語専門学校","H113311300256","13(東京)"]
["専門学校エビスビューティカレッジ","H113311300265","13(東京)"]
["専門学校東洋公衆衛生学院","H113311300274","13(東京)"]
["専修学校代々木ゼミナール造形学校","H113311300283","13(東京)"]
["日本赤十字社助産師学校","H113311300292","13(東京)"]
["青山製図専門学校","H113311300309","13(東京)"]
["日本写真芸術専門学校","H113311300318","13(東京)"]
["専門学校ビジョナリーアーツ","H113311300327","13(東京)"]
["専門学校東京クールジャパン","H113311300336","13(東京)"]
["専門学校ミューズ音楽院","H113311300345","13(東京)"]
["専修学校代々木ゼミナール本部校","H113311300354","13(東京)"]
["住田美容専門学校","H113311300363","13(東京)"]
["東放学園音響専門学校","H113311300372","13(東京)"]
["ヤマザキ動物専門学校","H113311300381","13(東京)"]
["ベルエポック美容専門学校","H113311300390","13(東京)"]
["織田調理師専門学校","H113311400022","13(東京)"]
["織田きもの専門学校","H113311400031","13(東京)"]
["織田ファッション専門学校","H113311400040","13(東京)"]
["窪田理容美容専門学校","H113311400059","13(東京)"]
["東京愛犬専門学校","H113311400068","13(東京)"]
["東京ブライダル専門学校","H113311400077","13(東京)"]
["専門学校東京工科自動車大学校","H113311400086","13(東京)"]
["東京警察病院看護専門学校","H113311400095","13(東京)"]
["専門学校東京ＣＰＡ会計学院","H113311400102","13(東京)"]
["ホスピタリティツーリズム専門学校","H113311400111","13(東京)"]
["織田栄養専門学校","H113311400120","13(東京)"]
["専門学校東京アナウンス学院","H113311400139","13(東京)"]
["アポロ歯科衛生士専門学校","H113311400148","13(東京)"]
["専門学校日本ホテルスクール","H113311400157","13(東京)"]
["専門学校東京テクニカルカレッジ","H113311400166","13(東京)"]
["渋谷外国語専門学校","H113311400175","13(東京)"]
["新宿情報ビジネス専門学校","H113311400184","13(東京)"]
["織田製菓専門学校","H113311400193","13(東京)"]
["阿佐ヶ谷美術専門学校","H113311500012","13(東京)"]
["玉成保育専門学校","H113311500021","13(東京)"]
["野田鎌田学園杉並高等専修学校","H113311500030","13(東京)"]
["東京保育専門学校","H113311500049","13(東京)"]
["東放学園専門学校","H113311500058","13(東京)"]
["佼成看護専門学校","H113311500067","13(東京)"]
["日本動物専門学校","H113311500076","13(東京)"]
["日本医歯薬専門学校","H113311500085","13(東京)"]
["東京ゴルフ専門学校","H113311500094","13(東京)"]
["専門学校日本鉄道＆スポーツビジネスカレッジ","H113311500101","13(東京)"]
["芳澍女学院情報国際専門学校","H113311500110","13(東京)"]
["東京ＩＴプログラミング＆会計専門学校杉並校","H113311500129","13(東京)"]
["東京法律公務員専門学校杉並校","H113311500138","13(東京)"]
["専修学校中央ゼミナール","H113311500147","13(東京)"]
["東京教育専門学校","H113311600011","13(東京)"]
["赤堀製菓専門学校","H113311600020","13(東京)"]
["東京服飾専門学校","H113311600039","13(東京)"]
["香川調理製菓専門学校","H113311600048","13(東京)"]
["城西放射線技術専門学校","H113311600066","13(東京)"]
["東京総合美容専門学校","H113311600075","13(東京)"]
["東京電子専門学校","H113311600084","13(東京)"]
["武蔵野調理師専門学校","H113311600093","13(東京)"]
["武蔵野栄養専門学校","H113311600100","13(東京)"]
["専門学校武蔵野ファッションカレッジ","H113311600119","13(東京)"]
["早稲田速記医療福祉専門学校","H113311600128","13(東京)"]
["早稲田文理専門学校","H113311600137","13(東京)"]
["専門学校東京ビジネス外語カレッジ","H113311600146","13(東京)"]
["創形美術学校","H113311600155","13(東京)"]
["日本外国語専門学校","H113311600164","13(東京)"]
["駿台トラベルアンドホテル専門学校","H113311600173","13(東京)"]
["すいどーばた美術学院","H113311600182","13(東京)"]
["草苑保育専門学校","H113311600191","13(東京)"]
["東京豊島ＩＴ医療福祉専門学校","H113311600208","13(東京)"]
["西武学園医学技術専門学校東京池袋校","H113311600217","13(東京)"]
["ミス・パリ・ビューティ専門学校","H113311600226","13(東京)"]
["東京日建工科専門学校","H113311600235","13(東京)"]
["東京福祉保育専門学校","H113311600244","13(東京)"]
["東京グローバルビジネス専門学校","H113311600253","13(東京)"]
["専門学校インターナショナル・スクールオブビジネス","H113311600262","13(東京)"]
["専修学校河合塾池袋校","H113311600271","13(東京)"]
["英進情報処理専門学校","H113311600280","13(東京)"]
["ＪＴＢトラベル＆ホテルカレッジ","H113311600299","13(東京)"]
["駿台予備学校池袋校","H113311600306","13(東京)"]
["中央法律専門学校","H113311600315","13(東京)"]
["専門学校舞台芸術学院","H113311600324","13(東京)"]
["大原情報ビジネス専門学校","H113311600333","13(東京)"]
["東京心理音楽療法福祉専門学校","H113311600342","13(東京)"]
["英進国際情報専門学校","H113311600351","13(東京)"]
["専門学校デジタルアーツ東京","H113311600360","13(東京)"]
["日本医療ビジネス大学校","H113311600379","13(東京)"]
["東京フード製菓中医薬専門学校","H113311600388","13(東京)"]
["日本リハビリテーション専門学校","H113311600397","13(東京)"]
["中央動物専門学校","H113311700010","13(東京)"]
["中央工学校","H113311700029","13(東京)"]
["王子経理専門学校","H113311700038","13(東京)"]
["東京ブレーメン動物専門学校","H113311700047","13(東京)"]
["東京歯科衛生専門学校","H113311700056","13(東京)"]
["コーセー美容専門学校","H113311700065","13(東京)"]
["北豊島医療専門学校","H113311800019","13(東京)"]
["専門学校東京ニットファッションアカデミー","H113311800028","13(東京)"]
["国際理容美容専門学校","H113311800037","13(東京)"]
["道灌山学園保育福祉専門学校","H113311800046","13(東京)"]
["東京女子医科大学看護専門学校","H113311800055","13(東京)"]
["太陽歯科衛生士専門学校","H113311800064","13(東京)"]
["国際共立学園高等専修学校","H113311800073","13(東京)"]
["日本総合医療専門学校","H113311800082","13(東京)"]
["板橋区医師会立看護高等専修学校","H113311900027","13(東京)"]
["加賀高等看護学院","H113311900036","13(東京)"]
["医療法人社団翠会成増高等看護学校","H113311900045","13(東京)"]
["板橋中央看護専門学校","H113311900054","13(東京)"]
["日本ペットアンドアニマル専門学校","H113311900063","13(東京)"]
["彰栄リハビリテーション専門学校","H113311900072","13(東京)"]
["帝京高等看護学院","H113311900081","13(東京)"]
["日本大学医学部附属看護専門学校","H113311900090","13(東京)"]
["上板橋看護専門学校","H113311900107","13(東京)"]
["日本ウェルネス歯科衛生専門学校","H113311900116","13(東京)"]
["資生堂美容技術専門学校","H113311900125","13(東京)"]
["中央美術学園","H113312000015","13(東京)"]
["東京柔道整復専門学校","H113312000024","13(東京)"]
["日本ウェルネススポーツ専門学校","H113312000033","13(東京)"]
["聖和看護専門学校","H113312100014","13(東京)"]
["東京未来大学福祉保育専門学校","H113312100023","13(東京)"]
["千住介護福祉専門学校","H113312100032","13(東京)"]
["西新井看護専門学校","H113312100041","13(東京)"]
["東京聖栄大学附属調理師専門学校","H113312200013","13(東京)"]
["国際鍼灸専門学校","H113312200022","13(東京)"]
["葛飾区医師会附属看護専門学校","H113312200031","13(東京)"]
["中央医療技術専門学校","H113312200040","13(東京)"]
["専門学校東京自動車大学校","H113312200059","13(東京)"]
["東京ウェディング・ホテル専門学校","H113312300012","13(東京)"]
["東京アニメ・声優＆ｅスポーツ専門学校","H113312300021","13(東京)"]
["愛国学園保育専門学校","H113312300030","13(東京)"]
["江戸川看護専門学校","H113312300049","13(東京)"]
["東京文化美容専門学校","H113312300058","13(東京)"]
["東京文化ブライダル専門学校","H113312300067","13(東京)"]
["東京マスダ学院文化服装専門学校","H113312300076","13(東京)"]
["東京マスダ学院調理師専門学校","H113312300085","13(東京)"]
["東京俳優・映画＆放送専門学校","H113312300101","13(東京)"]
["東京医薬看護専門学校","H113312300110","13(東京)"]
["東京ベルエポック製菓調理専門学校","H113312300129","13(東京)"]
["東京メディカル・スポーツ専門学校","H113312300138","13(東京)"]
["東京ベルエポック美容専門学校","H113312300147","13(東京)"]
["東京表現高等学院ＭＩＩＣＡ","H113312300156","13(東京)"]
["東京コミュニケーションアート専門学校","H113312300165","13(東京)"]
["東京福祉専門学校","H113312300174","13(東京)"]
["東京スポーツ・レクリエーション専門学校","H113312300183","13(東京)"]
["東京スクールオブミュージック＆ダンス専門学校","H113312300192","13(東京)"]
["ＴＣＡ東京ＥＣＯ動物海洋専門学校","H113312300209","13(東京)"]
["東京ホテル・ウェディング＆ＩＲ専門学校","H113312300218","13(東京)"]
["大竹高等専修学校","H113320100017","13(東京)"]
["専門学校トヨタ東京自動車大学校","H113320100026","13(東京)"]
["東京高尾看護専門学校","H113320100035","13(東京)"]
["アポロ美容理容専門学校","H113320100044","13(東京)"]
["国際電子会計専門学校","H113320100053","13(東京)"]
["日本工学院八王子専門学校","H113320100062","13(東京)"]
["萠愛調理師専門学校","H113320100071","13(東京)"]
["大竹栄養専門学校","H113320100080","13(東京)"]
["東京ビューティーアンドブライダル専門学校","H113320200016","13(東京)"]
["東京保育医療秘書専門学校","H113320200025","13(東京)"]
["西東京調理師専門学校","H113320200034","13(東京)"]
["関東柔道整復専門学校","H113320200043","13(東京)"]
["大原簿記公務員医療福祉保育専門学校立川校","H113320200052","13(東京)"]
["駿台予備学校立川校","H113320200061","13(東京)"]
["専修学校河合塾立川校","H113320200070","13(東京)"]
["国際製菓専門学校","H113320200089","13(東京)"]
["関東リハビリテーション専門学校","H113320200098","13(東京)"]
["東京立川歯科衛生学院専門学校","H113320200105","13(東京)"]
["吉祥寺二葉栄養調理専門職学校","H113320300015","13(東京)"]
["二葉ファッションアカデミー","H113320300024","13(東京)"]
["専門学校中野スクール・オブ・ビジネス","H113320300033","13(東京)"]
["武蔵野東高等専修学校","H113320300042","13(東京)"]
["武蔵野学芸専門学校","H113320300051","13(東京)"]
["吉祥寺二葉製菓専門職学校","H113320300060","13(東京)"]
["専門学校アジア・アフリカ語学院","H113320400023","13(東京)"]
["日商簿記三鷹福祉専門学校","H113320400032","13(東京)"]
["多摩リハビリテーション学院専門学校","H113320500013","13(東京)"]
["一般社団法人東京精神科病院協会府中看護高等専修学校","H113320600012","13(東京)"]
["東京西の森歯科衛生士専門学校","H113320700011","13(東京)"]
["町田製菓専門学校","H113320900019","13(東京)"]
["町田調理師専門学校","H113320900028","13(東京)"]
["町田デザイン＆建築専門学校","H113320900037","13(東京)"]
["町田美容専門学校","H113320900046","13(東京)"]
["町田福祉保育専門学校","H113320900055","13(東京)"]
["専修学校河合塾町田校","H113320900064","13(東京)"]
["大原簿記医療秘書公務員専門学校町田校","H113320900073","13(東京)"]
["アルファ医療福祉専門学校","H113320900082","13(東京)"]
["駿台予備学校町田校","H113320900091","13(東京)"]
["東京工学院専門学校","H113321000016","13(東京)"]
["専門学校社会医学技術学院","H113321000025","13(東京)"]
["東京エアトラベル・ホテル専門学校","H113321000034","13(東京)"]
["東邦歯科医療専門学校","H113321200014","13(東京)"]
["国際文化理容美容専門学校国分寺校","H113321400012","13(東京)"]
["日本芸術高等学園","H113321400021","13(東京)"]
["多摩情報経理専門学校","H113321400030","13(東京)"]
["東京ＹＭＣＡ医療福祉専門学校","H113321500011","13(東京)"]
["ディライトグローバル専門学校","H113321800018","13(東京)"]
["慈恵第三看護専門学校","H113321900017","13(東京)"]
["公益社団法人日本看護協会看護研修学校","H113322100013","13(東京)"]
["東京多摩調理製菓専門学校","H113322400010","13(東京)"]
["芸術工芸高等専修学校","H113322400029","13(東京)"]
["東京南看護専門学校","H113322500019","13(東京)"]
["横沢家政専門学校","H113322800016","13(東京)"]
["神奈川県立衛生看護専門学校","H114210010018","14(神奈川)"]
["神奈川県立よこはま看護専門学校","H114210010027","14(神奈川)"]
["横須賀市立看護専門学校","H114220120014","14(神奈川)"]
["神奈川県立平塚看護大学校","H114220310014","14(神奈川)"]
["藤沢市立看護専門学校","H114220520010","14(神奈川)"]
["横浜ファッションデザイン専門学校","H114310000018","14(神奈川)"]
["横浜市医師会聖灯看護専門学校","H114310000027","14(神奈川)"]
["浅野工学専門学校","H114310000036","14(神奈川)"]
["大原簿記情報ビジネス専門学校横浜校","H114310000045","14(神奈川)"]
["駿台予備学校横浜校","H114310000054","14(神奈川)"]
["横浜調理師専門学校","H114310000063","14(神奈川)"]
["横浜医療秘書専門学校","H114310000072","14(神奈川)"]
["大原法律公務員専門学校横浜校","H114310000081","14(神奈川)"]
["横浜日建工科専門学校","H114310000090","14(神奈川)"]
["大原医療秘書福祉保育専門学校横浜校","H114310000107","14(神奈川)"]
["横浜リゾートアンドスポーツ専門学校","H114310000116","14(神奈川)"]
["横浜ビューティーアンドブライダル専門学校","H114310000125","14(神奈川)"]
["横浜公務員＆ＩＴ会計専門学校","H114310000134","14(神奈川)"]
["横浜医療専門学校","H114310000143","14(神奈川)"]
["横浜こども専門学校","H114310000152","14(神奈川)"]
["情報科学専門学校","H114310000161","14(神奈川)"]
["横浜スイーツアンドカフェ専門学校","H114310000170","14(神奈川)"]
["横浜中央看護専門学校","H114310000189","14(神奈川)"]
["河合塾横浜校","H114310000198","14(神奈川)"]
["グレッグ外語専門学校横浜校","H114310000205","14(神奈川)"]
["横浜デザイン学院","H114310000214","14(神奈川)"]
["横浜経理専門学校","H114310000223","14(神奈川)"]
["横浜歯科医療専門学校","H114310000232","14(神奈川)"]
["岩谷学園テクノビジネス横浜保育専門学校","H114310000241","14(神奈川)"]
["横浜ｆカレッジ","H114310000250","14(神奈川)"]
["アーツカレッジヨコハマ","H114310000269","14(神奈川)"]
["国際フード製菓専門学校","H114310000278","14(神奈川)"]
["専門学校横浜ミュージックスクール","H114310000287","14(神奈川)"]
["岩谷学園アーティスティックＢ横浜美容専門学校","H114310000296","14(神奈川)"]
["岩谷学園高等専修学校","H114310000303","14(神奈川)"]
["横浜ＹＭＣＡ学院専門学校","H114310000312","14(神奈川)"]
["あずま工科専門学校","H114310000321","14(神奈川)"]
["地域医療機能推進機構横浜中央病院附属看護専門学校","H114310000330","14(神奈川)"]
["横浜テクノオート専門学校","H114310000349","14(神奈川)"]
["聖ヶ丘教育福祉専門学校","H114310000358","14(神奈川)"]
["横浜栄養専門学校","H114310000367","14(神奈川)"]
["横浜理容美容専門学校","H114310000376","14(神奈川)"]
["新横浜歯科衛生士・歯科技工士専門学校","H114310000385","14(神奈川)"]
["東京綜合写真専門学校","H114310000394","14(神奈川)"]
["横浜高等教育専門学校","H114310000401","14(神奈川)"]
["横浜医療情報専門学校","H114310000410","14(神奈川)"]
["横浜デジタルアーツ専門学校","H114310000429","14(神奈川)"]
["呉竹鍼灸柔整専門学校","H114310000438","14(神奈川)"]
["横浜きもの専門学校","H114310000447","14(神奈川)"]
["労働者健康安全機構横浜労災看護専門学校","H114310000456","14(神奈川)"]
["横浜実践看護専門学校","H114310000465","14(神奈川)"]
["野田鎌田学園横浜高等専修学校","H114310000474","14(神奈川)"]
["湘南医療福祉専門学校","H114310000483","14(神奈川)"]
["横浜ＹＭＣＡスポーツ専門学校","H114310000492","14(神奈川)"]
["横浜リハビリテーション専門学校","H114310000508","14(神奈川)"]
["国立病院機構横浜医療センター附属横浜看護学校","H114310000517","14(神奈川)"]
["横浜保育福祉専門学校","H114310000526","14(神奈川)"]
["横浜未来看護専門学校","H114310000535","14(神奈川)"]
["横浜市病院協会看護専門学校","H114310000544","14(神奈川)"]
["専門学校日産横浜自動車大学校","H114310000553","14(神奈川)"]
["横浜システム工学院専門学校","H114310000562","14(神奈川)"]
["イムス横浜国際看護専門学校","H114310000571","14(神奈川)"]
["たまプラーザ看護学校","H114310000580","14(神奈川)"]
["横浜芸術高等専修学校","H114310000599","14(神奈川)"]
["外語ビジネス専門学校","H114313000012","14(神奈川)"]
["神奈川ビューティー＆ビジネス専門学校","H114313000021","14(神奈川)"]
["日本溶接構造専門学校","H114313000030","14(神奈川)"]
["米山ファッション・ビジネス専門学校","H114313000049","14(神奈川)"]
["ＹＭＣＡ国際ビジネス専門学校","H114313000067","14(神奈川)"]
["聖マリアンナ医科大学看護専門学校","H114313000076","14(神奈川)"]
["高津看護専門学校","H114313000085","14(神奈川)"]
["神奈川経済専門学校","H114315000017","14(神奈川)"]
["相模原調理師専門学校","H114315000026","14(神奈川)"]
["相模原ビジネス公務員専門学校","H114315000035","14(神奈川)"]
["医療ビジネス観光福祉専門学校","H114315000044","14(神奈川)"]
["神奈川柔整鍼灸専門学校","H114315000053","14(神奈川)"]
["相模原看護専門学校","H114315000062","14(神奈川)"]
["横須賀法律行政専門学校","H114320100016","14(神奈川)"]
["ヨコスカ調理製菓専門学校","H114320100025","14(神奈川)"]
["神奈川衛生学園専門学校","H114320100034","14(神奈川)"]
["湘南歯科衛生士専門学校","H114320300014","14(神奈川)"]
["神奈川社会福祉専門学校","H114320300023","14(神奈川)"]
["湘南平塚看護専門学校","H114320300032","14(神奈川)"]
["日本ヒューマンセレモニー専門学校","H114320300041","14(神奈川)"]
["湘南ウェディング専門学校","H114320300050","14(神奈川)"]
["鎌倉早見美容芸術専門学校","H114320400013","14(神奈川)"]
["専門学校国際新堀芸術学院","H114320500012","14(神奈川)"]
["日本ガーデンデザイン専門学校","H114320500021","14(神奈川)"]
["湘南看護専門学校","H114320500030","14(神奈川)"]
["崎村調理師専門学校","H114320600011","14(神奈川)"]
["小澤高等看護学院","H114320600020","14(神奈川)"]
["積善会看護専門学校","H114320600039","14(神奈川)"]
["おだわら看護専門学校","H114320600048","14(神奈川)"]
["茅ヶ崎看護専門学校","H114320700010","14(神奈川)"]
["茅ヶ崎リハビリテーション専門学校","H114320700029","14(神奈川)"]
["アイム湘南理容美容専門学校","H114321100014","14(神奈川)"]
["専門学校神奈川総合大学校","H114321200013","14(神奈川)"]
["厚木総合専門学校","H114321200031","14(神奈川)"]
["厚木看護専門学校","H114321200040","14(神奈川)"]
["ＹＭＣＡ健康福祉専門学校","H114321200068","14(神奈川)"]
["大和商業高等専修学校","H114321300012","14(神奈川)"]
["柏木実業専門学校","H114321300021","14(神奈川)"]
["国際総合健康専門学校","H114321400011","14(神奈川)"]
["湘央医学技術専門学校","H114321800017","14(神奈川)"]
["湘央生命科学技術専門学校","H114321800026","14(神奈川)"]
["生蘭高等専修学校","H114321800035","14(神奈川)"]
["新潟県農業大学校","H115210000019","15(新潟)"]
["新潟県立新発田病院附属看護専門学校","H115220600012","15(新潟)"]
["新潟県立十日町看護専門学校","H115221000016","15(新潟)"]
["新潟県立吉田病院附属看護専門学校","H115221300013","15(新潟)"]
["ひまわり幼児教育専門学院","H115310000017","15(新潟)"]
["新潟文化服装専門学校","H115310000026","15(新潟)"]
["国際トータルファッション専門学校","H115310000035","15(新潟)"]
["新潟調理師専門学校","H115310000044","15(新潟)"]
["新潟理容美容専門学校","H115310000053","15(新潟)"]
["新潟デザイン専門学校","H115310000062","15(新潟)"]
["新潟情報専門学校","H115310000071","15(新潟)"]
["新潟ビジネス専門学校","H115310000080","15(新潟)"]
["新潟英語専門学校","H115310000099","15(新潟)"]
["日本自然環境専門学校","H115310000106","15(新潟)"]
["新潟コンピュ－タ－専門学校","H115310000115","15(新潟)"]
["大原簿記公務員専門学校新潟校","H115310000124","15(新潟)"]
["新潟こども医療専門学校","H115310000133","15(新潟)"]
["国際外語・観光・エアライン専門学校","H115310000142","15(新潟)"]
["国際こども福祉カレッジ","H115310000151","15(新潟)"]
["新潟工科専門学校","H115310000160","15(新潟)"]
["アップルスポーツカレッジ","H115310000179","15(新潟)"]
["国際音楽・ダンス・エンタテイメント専門学校","H115310000188","15(新潟)"]
["新潟会計ビジネス専門学校","H115310000197","15(新潟)"]
["にいがた製菓・調理専門学校えぷろん","H115310000204","15(新潟)"]
["新潟医療福祉カレッジ","H115310000213","15(新潟)"]
["新潟日建工科専門学校","H115310000222","15(新潟)"]
["新潟公務員法律専門学校","H115310000231","15(新潟)"]
["国際ペットワールド専門学校","H115310000240","15(新潟)"]
["日本アニメマンガ専門学校","H115310000259","15(新潟)"]
["国際ビューティモード専門学校","H115310000268","15(新潟)"]
["専修学校代々木ゼミナール新潟校","H115310000277","15(新潟)"]
["国際メディカル専門学校","H115310000286","15(新潟)"]
["大原情報医療専門学校新潟校","H115310000295","15(新潟)"]
["国際ホテルブライダル専門学校","H115310000302","15(新潟)"]
["専門学校新潟国際自動車大学校","H115310000311","15(新潟)"]
["国際調理製菓専門学校","H115310000320","15(新潟)"]
["シェフパティシエ専門学校","H115310000339","15(新潟)"]
["看護リハビリ新潟保健医療専門学校","H115310000348","15(新潟)"]
["国際映像メディア専門学校","H115310000357","15(新潟)"]
["新潟高度情報専門学校","H115310000366","15(新潟)"]
["新潟美容専門学校ジャパンビューティアカデミー","H115310000375","15(新潟)"]
["フォーラム情報アカデミー専門学校","H115310000384","15(新潟)"]
["新潟農業バイオ専門学校","H115310000393","15(新潟)"]
["新潟柔整専門学校","H115310000400","15(新潟)"]
["新潟法律大学校","H115310000419","15(新潟)"]
["新潟こども保育カレッジ","H115310000428","15(新潟)"]
["真柄学園服装専門学校","H115310000437","15(新潟)"]
["新潟医療技術専門学校","H115310000446","15(新潟)"]
["日本こども福祉専門学校","H115310000455","15(新潟)"]
["新潟看護医療専門学校","H115310000464","15(新潟)"]
["長岡赤十字看護専門学校","H115320200014","15(新潟)"]
["新潟県厚生農業協同組合連合会中央看護専門学校","H115320200023","15(新潟)"]
["北陸食育フードカレッジ","H115320200032","15(新潟)"]
["悠久山栄養調理専門学校","H115320200041","15(新潟)"]
["長岡公務員・情報ビジネス専門学校","H115320200050","15(新潟)"]
["北陸福祉保育専門学院","H115320200069","15(新潟)"]
["日本ビジネス公務員専門学校","H115320200078","15(新潟)"]
["長岡崇徳福祉専門学校","H115320200087","15(新潟)"]
["晴陵リハビリテーション学院","H115320200096","15(新潟)"]
["長岡美容専門学校","H115320200103","15(新潟)"]
["長岡こども福祉カレッジ","H115320200112","15(新潟)"]
["クレアヘアモード専門学校","H115320200121","15(新潟)"]
["長岡介護福祉専門学校あゆみ","H115320200130","15(新潟)"]
["長岡こども・医療・介護専門学校","H115320200149","15(新潟)"]
["晴麗看護学校","H115320200158","15(新潟)"]
["三条服装専門学校","H115320400012","15(新潟)"]
["三条看護・医療・歯科衛生専門学校","H115320400021","15(新潟)"]
["国立病院機構新潟病院附属看護学校","H115320500011","15(新潟)"]
["蒲沢服装専門学校","H115320900017","15(新潟)"]
["十日町服飾専門学校","H115321000014","15(新潟)"]
["新潟看護医療専門学校村上校","H115321200012","15(新潟)"]
["全日本ウィンタースポーツ専門学校","H115321700017","15(新潟)"]
["国際自然環境アウトドア専門学校","H115321700026","15(新潟)"]
["五泉服装専門学校","H115321800016","15(新潟)"]
["上越服装専門学校","H115322200010","15(新潟)"]
["上越公務員・情報ビジネス専門学校","H115322200029","15(新潟)"]
["上越保健医療福祉専門学校","H115322200038","15(新潟)"]
["上越看護専門学校","H115322200047","15(新潟)"]
["新潟県厚生農業協同組合連合会佐渡看護専門学校","H115322400018","15(新潟)"]
["伝統文化と環境福祉の専門学校","H115322400027","15(新潟)"]
["佐渡保育専門学校","H115322400036","15(新潟)"]
["日本ウェルネススポーツ専門学校新潟校","H115322500017","15(新潟)"]
["北里大学保健衛生専門学院","H115322600016","15(新潟)"]
["ＪＡＰＡＮサッカーカレッジ","H115330700018","15(新潟)"]
["富山市立看護専門学校","H116220180028","16(富山)"]
["富山市立富山外国語専門学校","H116220180037","16(富山)"]
["富山市立富山ガラス造形研究所","H116220180046","16(富山)"]
["富山クリエイティブ専門学校","H116320180053","16(富山)"]
["富山県理容美容専門学校","H116320180062","16(富山)"]
["臼井美容専門学校","H116320180071","16(富山)"]
["富山市医師会看護専門学校","H116320180099","16(富山)"]
["富山歯科総合学院","H116320180106","16(富山)"]
["北陸ビジネス福祉専門学校","H116320180115","16(富山)"]
["富山大原簿記公務員医療専門学校","H116320180124","16(富山)"]
["専門学校職藝学院","H116320180133","16(富山)"]
["独立行政法人国立病院機構富山病院附属看護学校","H116320180142","16(富山)"]
["富山自動車整備専門学校","H116320180151","16(富山)"]
["専門学校富山ビューティーカレッジ","H116320180160","16(富山)"]
["富山リハビリテーション医療福祉大学校","H116320180179","16(富山)"]
["富山調理製菓専門学校","H116320180188","16(富山)"]
["高岡第一学園幼稚園教諭・保育士養成所","H116320280016","16(富山)"]
["安川専門学校ロイモード学院","H116320280025","16(富山)"]
["富山県高岡看護専門学校","H116320280034","16(富山)"]
["富山医療福祉専門学校","H116320680012","16(富山)"]
["富山情報ビジネス専門学校","H116321180015","16(富山)"]
["雄山家政専修学校","H116332380010","16(富山)"]
["石川県立保育専門学園","H117220100015","17(石川)"]
["石川県立総合看護専門学校","H117220100024","17(石川)"]
["加賀看護学校","H117220600010","17(石川)"]
["専門学校金沢文化服装学院","H117320100013","17(石川)"]
["専門学校金沢美専","H117320100022","17(石川)"]
["北信越柔整専門学校","H117320100031","17(石川)"]
["石川県調理師専門学校","H117320100059","17(石川)"]
["石川県理容美容専門学校","H117320100068","17(石川)"]
["石川県歯科医師会立歯科医療専門学校","H117320100077","17(石川)"]
["専門学校ファースト学園金沢校","H117320100086","17(石川)"]
["大原簿記法律観光専門学校金沢校","H117320100095","17(石川)"]
["北陸デザイナー専門学校","H117320100102","17(石川)"]
["（専）金沢科学技術大学校","H117320100111","17(石川)"]
["金沢製菓調理専門学校","H117320100120","17(石川)"]
["金沢医療技術専門学校","H117320100139","17(石川)"]
["金沢福祉専門学校","H117320100148","17(石川)"]
["金沢看護専門学校","H117320100157","17(石川)"]
["金沢国際専門学校","H117320100166","17(石川)"]
["専門学校アリス学園","H117320100175","17(石川)"]
["金沢情報ＩＴクリエイター","H117320100184","17(石川)"]
["専門学校金沢リハビリテーションアカデミー","H117320100193","17(石川)"]
["金沢ウエディング・ビューティー専門学校","H117320100200","17(石川)"]
["スーパースイーツ製菓専門学校","H117320100219","17(石川)"]
["大原医療福祉・製菓＆スポーツ専門学校","H117320100228","17(石川)"]
["国際ホテル＆ブライダル専門学校","H117320100237","17(石川)"]
["金沢医療センター附属金沢看護学校","H117320100246","17(石川)"]
["七尾服飾専門学校","H117320200012","17(石川)"]
["七尾看護専門学校","H117320200021","17(石川)"]
["国際医療福祉専門学校七尾校","H117320200030","17(石川)"]
["（専）日本航空大学校","H117320400010","17(石川)"]
["専門学校アリス学園加賀分校","H117320600018","17(石川)"]
["金沢医療事務専門学校","H117321000012","17(石川)"]
["国際ペット専門学校金沢","H117321000021","17(石川)"]
["国際調理専門学校","H117321000049","17(石川)"]
["国際動物看護専門学校","H117321000058","17(石川)"]
["ハピネス学園プロスポーツ育成専門学校","H117336100019","17(石川)"]
["福井県立看護専門学校","H118210000016","18(福井)"]
["公立若狭高等看護学院","H118210000025","18(福井)"]
["専門学校デザイン・ラボフクイ","H118310000023","18(福井)"]
["専門学校福井文化服装学院","H118310000032","18(福井)"]
["福井県理容美容専門学校","H118310000041","18(福井)"]
["武生看護専門学校","H118310000050","18(福井)"]
["天谷調理製菓専門学校","H118310000069","18(福井)"]
["福井市医師会看護専門学校","H118310000078","18(福井)"]
["大原簿記法律専門学校福井校","H118310000087","18(福井)"]
["青池調理師専門学校","H118310000096","18(福井)"]
["福井歯科専門学校","H118310000103","18(福井)"]
["福井ホテルトラベル専門学校","H118310000112","18(福井)"]
["福井情報ＩＴクリエイター専門学校","H118310000121","18(福井)"]
["大原スポーツ医療保育福祉専門学校","H118310000130","18(福井)"]
["福井県医療福祉専門学校","H118310000149","18(福井)"]
["若狭医療福祉専門学校","H118310000158","18(福井)"]
["国際ペット専門学校福井","H118310000167","18(福井)"]
["福井製菓専門学校","H118310000176","18(福井)"]
["福井公務員専門学校","H118310000185","18(福井)"]
["山梨県立宝石美術専門学校","H119210000015","19(山梨)"]
["甲府市立甲府商科専門学校","H119210000024","19(山梨)"]
["富士吉田市立看護専門学校","H119210000033","19(山梨)"]
["専門学校山梨県立農林大学校","H119210000042","19(山梨)"]
["山梨予備校","H119310000013","19(山梨)"]
["山梨女子専門学校","H119310000022","19(山梨)"]
["モードアカデミー服装専門学校","H119310000031","19(山梨)"]
["共立高等看護学院","H119310000040","19(山梨)"]
["甲府ドレメ学院","H119310000059","19(山梨)"]
["日本航空大学校山梨","H119310000068","19(山梨)"]
["甲府看護専門学校","H119310000077","19(山梨)"]
["山梨県歯科衛生専門学校","H119310000086","19(山梨)"]
["山梨情報専門学校","H119310000095","19(山梨)"]
["帝京山梨看護専門学校","H119310000102","19(山梨)"]
["帝京福祉専門学校","H119310000111","19(山梨)"]
["専門学校甲府医療秘書学院","H119310000120","19(山梨)"]
["専門学校サンテクノカレッジ","H119310000139","19(山梨)"]
["山梨県美容専門学校","H119310000148","19(山梨)"]
["生長の家養心女子学園","H119310000157","19(山梨)"]
["女神の森ライフクリエイト専門学校","H119310000166","19(山梨)"]
["山梨秀峰調理師専門学校","H119310000175","19(山梨)"]
["優和福祉専門学校","H119310000184","19(山梨)"]
["大原簿記情報ビジネス医療福祉保育専門学校甲府校","H119310000193","19(山梨)"]
["大原スポーツ公務員専門学校甲府校","H119310000200","19(山梨)"]
["長野県農業大学校","H120220100010","20(長野)"]
["岡谷市看護専門学校","H120220400017","20(長野)"]
["長野県福祉大学校","H120220600015","20(長野)"]
["長野県須坂看護専門学校","H120220700014","20(長野)"]
["長野県公衆衛生専門学校","H120220900012","20(長野)"]
["諏訪中央病院看護専門学校","H120221400015","20(長野)"]
["長野県林業大学校","H120243200011","20(長野)"]
["文化学園大学保育専門学校","H120320100018","20(長野)"]
["専門学校カレッジオブキャリア","H120320100027","20(長野)"]
["長野社会ふくし専門学校","H120320100036","20(長野)"]
["長野平青学園","H120320100045","20(長野)"]
["大原スポーツ公務員専門学校","H120320100054","20(長野)"]
["長野調理製菓専門学校","H120320100063","20(長野)"]
["信越情報専門学校２１ルネサンス学院","H120320100072","20(長野)"]
["長野赤十字看護専門学校","H120320100081","20(長野)"]
["長野理容美容専門学校","H120320100090","20(長野)"]
["岡学園トータルデザインアカデミー","H120320100107","20(長野)"]
["長野美術専門学校","H120320100116","20(長野)"]
["長野法律高度専門学校","H120320100125","20(長野)"]
["信州スポーツ医療福祉専門学校","H120320100134","20(長野)"]
["専門学校長野自動車大学校","H120320100143","20(長野)"]
["長野看護専門学校","H120320100152","20(長野)"]
["大原簿記情報ビジネス医療専門学校","H120320100161","20(長野)"]
["豊野高等専修学校","H120320100170","20(長野)"]
["松本調理師製菓師専門学校","H120320200017","20(長野)"]
["専門学校未来ビジネスカレッジ","H120320200026","20(長野)"]
["松本情報工科専門学校","H120320200035","20(長野)"]
["大原スポーツ公務員専門学校松本校","H120320200044","20(長野)"]
["大原簿記情報ビジネス医療専門学校松本校","H120320200053","20(長野)"]
["松本理容美容専門学校","H120320200071","20(長野)"]
["松本医療福祉専門学校","H120320200080","20(長野)"]
["丸の内ビジネス専門学校","H120320200099","20(長野)"]
["松本経理ビジネス専門学校","H120320200106","20(長野)"]
["松本看護専門学校","H120320200115","20(長野)"]
["独立行政法人国立病院機構信州上田医療センター附属看護学校","H120320300016","20(長野)"]
["上田情報ビジネス専門学校","H120320300025","20(長野)"]
["綿良学園上田総合文化専門学校","H120320300034","20(長野)"]
["長野医療衛生専門学校","H120320300043","20(長野)"]
["専門学校長野ビジネス外語カレッジ","H120320300052","20(長野)"]
["上田看護専門学校","H120320300070","20(長野)"]
["上條経理専修学校","H120320400015","20(長野)"]
["岡谷音楽専門学校","H120320400024","20(長野)"]
["飯田コアカレッジ","H120320500014","20(長野)"]
["飯田ビジネス専門学校","H120320500023","20(長野)"]
["エプソン情報科学専門学校","H120320600013","20(長野)"]
["諏訪赤十字看護専門学校","H120320600022","20(長野)"]
["小諸看護専門学校","H120320800011","20(長野)"]
["やまと文化専修学校","H120321000017","20(長野)"]
["松本歯科大学衛生学院","H120321500012","20(長野)"]
["信州介護福祉専門学校","H120321500021","20(長野)"]
["信州リハビリテーション専門学校","H120321500030","20(長野)"]
["佐久総合病院看護専門学校","H120321700010","20(長野)"]
["臼田経理専門学校","H120321700029","20(長野)"]
["専門学校アースビジネスカレッジ","H120321700038","20(長野)"]
["長野救命医療専門学校","H120321900018","20(長野)"]
["八ヶ岳中央農業実践大学校","H120336300012","20(長野)"]
["信州木曽看護専門学校","H120343200019","20(長野)"]
["日本アルプス国際学院","H120348100019","20(長野)"]
["岐阜県立衛生専門学校","H121220100019","21(岐阜)"]
["岐阜市立看護専門学校","H121220100028","21(岐阜)"]
["岐阜県立多治見看護専門学校","H121220400016","21(岐阜)"]
["岐阜県立森林文化アカデミー","H121220700013","21(岐阜)"]
["東濃西部広域行政事務組合立東濃看護専門学校","H121221200016","21(岐阜)"]
["岐阜県立国際園芸アカデミー","H121221400014","21(岐阜)"]
["岐阜県立下呂看護専門学校","H121222000016","21(岐阜)"]
["石木編物専門学校","H121320100017","21(岐阜)"]
["コロムビア・ファッション・カレッジ","H121320100026","21(岐阜)"]
["飯原服装専門学校","H121320100035","21(岐阜)"]
["岐阜調理専門学校","H121320100044","21(岐阜)"]
["城南高等専修学校","H121320100053","21(岐阜)"]
["岐阜美容専門学校","H121320100062","21(岐阜)"]
["ベルフォート美容専門学校","H121320100071","21(岐阜)"]
["岐阜歯科衛生専門学校","H121320100080","21(岐阜)"]
["岐阜保健大学医療専門学校","H121320100099","21(岐阜)"]
["岐阜市医師会看護学校","H121320100106","21(岐阜)"]
["ＴｏＢｕＣｏ専門学校","H121320100115","21(岐阜)"]
["大原簿記医療観光専門学校岐阜校","H121320100124","21(岐阜)"]
["大原法律公務員専門学校岐阜校","H121320100133","21(岐阜)"]
["ヴィジョンネクスト情報デザイン専門学校","H121320200016","21(岐阜)"]
["大垣市医師会看護専門学校","H121320200025","21(岐阜)"]
["日本総合ビジネス専門学校","H121320200034","21(岐阜)"]
["ＪＡ岐阜厚生連看護専門学校","H121320300015","21(岐阜)"]
["多治見文化洋裁学院","H121320400014","21(岐阜)"]
["ミユキ文化服飾専門学校","H121320400023","21(岐阜)"]
["アンファッションカレッジ","H121320400032","21(岐阜)"]
["中日本航空専門学校","H121320500013","21(岐阜)"]
["日本プロスポーツ専門学校","H121320800010","21(岐阜)"]
["あじさい看護福祉専門学校","H121321100015","21(岐阜)"]
["専修学校中部国際自動車大学校","H121321200014","21(岐阜)"]
["朝日大学歯科衛生士専門学校","H121321600010","21(岐阜)"]
["サンビレッジ国際医療福祉専門学校","H121340400012","21(岐阜)"]
["静岡県立看護専門学校","H122210000010","22(静岡)"]
["浜松市立看護専門学校","H122210000029","22(静岡)"]
["静岡市立静岡看護専門学校","H122210000038","22(静岡)"]
["島田市立看護専門学校","H122210000047","22(静岡)"]
["組合立静岡県中部看護専門学校","H122210000056","22(静岡)"]
["富士市立看護専門学校","H122210000065","22(静岡)"]
["沼津市立看護専門学校","H122210000074","22(静岡)"]
["静岡市立清水看護専門学校","H122210000083","22(静岡)"]
["東海アクシス看護専門学校","H122210000109","22(静岡)"]
["沼津情報・ビジネス専門学校","H122310000018","22(静岡)"]
["大原公務員医療観光専門学校沼津校","H122310000027","22(静岡)"]
["大原介護福祉専門学校沼津校","H122310000036","22(静岡)"]
["国際観光専門学校熱海校","H122310000045","22(静岡)"]
["東海医療学園専門学校","H122310000063","22(静岡)"]
["国際ペットビジネス専門学校熱海校","H122310000072","22(静岡)"]
["中央歯科衛生士調理製菓専門学校","H122310000081","22(静岡)"]
["静岡県東部総合美容専門学校","H122310000090","22(静岡)"]
["富士コンピュータ専門学校","H122310000107","22(静岡)"]
["富士調理技術専門学校","H122310000116","22(静岡)"]
["タカヤマアドバンスビューティー専門学校","H122310000125","22(静岡)"]
["専門学校富士リハビリテーション大学校","H122310000134","22(静岡)"]
["ＪＡ静岡厚生連するが看護専門学校","H122310000143","22(静岡)"]
["富士宮高等専修学校","H122310000152","22(静岡)"]
["日本建築専門学校","H122310000161","22(静岡)"]
["日本書道芸術専門学校","H122310000170","22(静岡)"]
["湘南医療大学附属下田看護専門学校","H122310000189","22(静岡)"]
["御殿場看護学校","H122310000198","22(静岡)"]
["国際マネジメント＆ケア専門学校","H122310000205","22(静岡)"]
["静岡医療センター附属静岡看護学校","H122310000214","22(静岡)"]
["静岡産業技術専門学校","H122310000223","22(静岡)"]
["専門学校ノアデザインカレッジ","H122310000232","22(静岡)"]
["静岡デザイン専門学校","H122310000241","22(静岡)"]
["静岡県美容専門学校","H122310000250","22(静岡)"]
["中央調理製菓専門学校静岡校","H122310000269","22(静岡)"]
["辻村和服専門学校","H122310000278","22(静岡)"]
["専修学校静岡学園早慶セミナー","H122310000287","22(静岡)"]
["プロスペラ学院ビジネス専門学校","H122310000296","22(静岡)"]
["大原簿記情報医療専門学校静岡校","H122310000303","22(静岡)"]
["駿河学院専門学校","H122310000312","22(静岡)"]
["専門学校静岡電子情報カレッジ","H122310000321","22(静岡)"]
["静岡済生会看護専門学校","H122310000330","22(静岡)"]
["専門学校静岡工科自動車大学校","H122310000349","22(静岡)"]
["専門学校静岡医療秘書学院","H122310000358","22(静岡)"]
["大原トラベル・ホテル・ブライダル専門学校静岡校","H122310000367","22(静岡)"]
["大原法律公務員専門学校静岡校","H122310000376","22(静岡)"]
["静岡福祉医療専門学校","H122310000385","22(静岡)"]
["静進情報高等専修学校","H122310000394","22(静岡)"]
["静岡インターナショナル・エア・リゾート専門学校","H122310000401","22(静岡)"]
["国際ことば学院外国語専門学校","H122310000410","22(静岡)"]
["専門学校中央医療健康大学校","H122310000429","22(静岡)"]
["川口調理師専門学校","H122310000438","22(静岡)"]
["清水学院高等専修学校","H122310000447","22(静岡)"]
["静岡医療学園専門学校","H122310000456","22(静岡)"]
["中央動物総合専門学校","H122310000465","22(静岡)"]
["島田実業高等専修学校","H122310000474","22(静岡)"]
["藤枝学院高等専修学校","H122310000483","22(静岡)"]
["静岡アルス美容専門学校","H122310000492","22(静岡)"]
["中遠調理師専門学校","H122310000508","22(静岡)"]
["富士メカニック専門学校","H122310000517","22(静岡)"]
["デザインテクノロジー専門学校","H122310000526","22(静岡)"]
["静岡県西部理容美容専門学校","H122310000535","22(静岡)"]
["静岡県厚生連看護専門学校","H122310000544","22(静岡)"]
["浜松調理菓子専門学校","H122310000553","22(静岡)"]
["東海調理製菓専門学校","H122310000562","22(静岡)"]
["大原簿記情報医療専門学校浜松校","H122310000571","22(静岡)"]
["浜松歯科衛生士専門学校","H122310000580","22(静岡)"]
["浜松市医師会看護高等専修学校","H122310000599","22(静岡)"]
["浜松未来総合専門学校","H122310000606","22(静岡)"]
["国際観光専門学校浜松校","H122310000615","22(静岡)"]
["国際医療管理専門学校浜松校","H122310000624","22(静岡)"]
["大原トラベル・ホテル・ブライダル専門学校浜松校","H122310000633","22(静岡)"]
["専門学校東海工科自動車大学校","H122310000642","22(静岡)"]
["ルネサンスデザイン・美容専門学校","H122310000651","22(静岡)"]
["東海文化高等専修学校","H122310000660","22(静岡)"]
["静岡こども福祉専門学校","H122310000679","22(静岡)"]
["静岡歯科衛生士専門学校","H122310000688","22(静岡)"]
["静岡新美容専門学校","H122310000697","22(静岡)"]
["オイスカ開発教育専門学校","H122310000704","22(静岡)"]
["専門学校静岡医療科学専門大学校","H122310000713","22(静岡)"]
["大原法律公務員専門学校浜松校","H122310000722","22(静岡)"]
["浜松日建工科専門学校","H122310000731","22(静岡)"]
["専門学校浜松医療学院","H122310000740","22(静岡)"]
["東海歯科衛生士専門学校","H122310000759","22(静岡)"]
["静岡東都医療専門学校","H122310000768","22(静岡)"]
["専門学校浜松デザインカレッジ","H122310000777","22(静岡)"]
["専門学校ルネサンス・ペット・アカデミー","H122310000786","22(静岡)"]
["専修学校河合塾浜松校","H122310000795","22(静岡)"]
["東海こども専門学校","H122310000802","22(静岡)"]
["聖隷クリストファー大学介護福祉専門学校","H122310000811","22(静岡)"]
["駿台予備学校浜松校","H122310000820","22(静岡)"]
["愛知県立総合看護専門学校","H123210000000","23(愛知)"]
["県立愛知看護専門学校","H123210000019","23(愛知)"]
["愛知県立農業大学校","H123210000028","23(愛知)"]
["名古屋市立中央看護専門学校","H123210000037","23(愛知)"]
["半田常滑看護専門学校","H123210000046","23(愛知)"]
["豊橋市立家政高等専修学校","H123210000055","23(愛知)"]
["豊橋市立看護専門学校","H123210000064","23(愛知)"]
["蒲郡市立ソフィア看護専門学校","H123210000073","23(愛知)"]
["岡崎市立看護専門学校","H123210000082","23(愛知)"]
["公立西知多看護専門学校","H123210000091","23(愛知)"]
["津島市立看護専門学校","H123210000108","23(愛知)"]
["公立春日井小牧看護専門学校","H123210000117","23(愛知)"]
["公立瀬戸旭看護専門学校","H123210000135","23(愛知)"]
["西尾市立看護専門学校","H123210000144","23(愛知)"]
["東名古屋病院附属リハビリテーション学院","H123310000008","23(愛知)"]
["専門学校星城大学リハビリテーション学院","H123310000017","23(愛知)"]
["アリアーレビューティー専門学校","H123310000026","23(愛知)"]
["トライデント外国語・ホテル・ブライダル専門学校","H123310000035","23(愛知)"]
["愛知学院大学歯科技工専門学校","H123310000044","23(愛知)"]
["ニチエイ調理専門学校","H123310000053","23(愛知)"]
["名古屋経営会計専門学校","H123310000062","23(愛知)"]
["名古屋ビューティー専門学校","H123310000071","23(愛知)"]
["菊武ビジネス専門学校","H123310000080","23(愛知)"]
["名古屋文化学園保育専門学校","H123310000099","23(愛知)"]
["キクチ眼鏡専門学校","H123310000106","23(愛知)"]
["中京法律専門学校","H123310000115","23(愛知)"]
["布池外語専門学校","H123310000124","23(愛知)"]
["ナゴノ福祉歯科医療専門学校","H123310000133","23(愛知)"]
["愛知調理専門学校","H123310000142","23(愛知)"]
["名古屋歯科医療専門学校","H123310000151","23(愛知)"]
["名古屋市歯科医師会附属歯科衛生士専門学校","H123310000160","23(愛知)"]
["愛生会看護専門学校","H123310000179","23(愛知)"]
["専門学校名古屋ウェディング＆フラワー・ビューティ学院","H123310000188","23(愛知)"]
["専門学校エクラ","H123310000197","23(愛知)"]
["ミス・パリエステティック専門学校名古屋校","H123310000204","23(愛知)"]
["名古屋ユマニテク調理製菓専門学校","H123310000213","23(愛知)"]
["名鉄看護専門学校","H123310000222","23(愛知)"]
["名西文化服装学院","H123310000231","23(愛知)"]
["国際調理師専門学校名駅校","H123310000240","23(愛知)"]
["名古屋文理栄養士専門学校","H123310000259","23(愛知)"]
["名古屋医療秘書福祉専門学校","H123310000268","23(愛知)"]
["米田柔整専門学校","H123310000277","23(愛知)"]
["名古屋モード学園","H123310000286","23(愛知)"]
["中和医療専門学校","H123310000295","23(愛知)"]
["専門学校日本デザイナー芸術学院","H123310000302","23(愛知)"]
["大原簿記情報医療専門学校","H123310000311","23(愛知)"]
["中部リハビリテーション専門学校","H123310000320","23(愛知)"]
["名古屋福祉専門学校","H123310000339","23(愛知)"]
["名古屋情報メディア専門学校","H123310000348","23(愛知)"]
["専門学校名古屋デザイナー学院","H123310000357","23(愛知)"]
["専門学校名古屋ビジュアルアーツ","H123310000366","23(愛知)"]
["国際観光専門学校名古屋校","H123310000375","23(愛知)"]
["専修学校東洋調理技術学院","H123310000384","23(愛知)"]
["中日美容専門学校","H123310000393","23(愛知)"]
["愛知文化服装専門学校","H123310000419","23(愛知)"]
["中部楽器技術専門学校","H123310000428","23(愛知)"]
["名古屋調理師専門学校","H123310000437","23(愛知)"]
["名古屋美容専門学校","H123310000446","23(愛知)"]
["専修学校代々木ゼミナール名古屋校","H123310000455","23(愛知)"]
["東海医療科学専門学校","H123310000464","23(愛知)"]
["名古屋医専","H123310000473","23(愛知)"]
["専門学校日本マンガ芸術学院","H123310000482","23(愛知)"]
["明美文化服装専門学校","H123310000491","23(愛知)"]
["名古屋工学院専門学校","H123310000507","23(愛知)"]
["東海工業専門学校熱田校","H123310000516","23(愛知)"]
["サンデザイン専門学校","H123310000525","23(愛知)"]
["あいちビジネス専門学校","H123310000534","23(愛知)"]
["あいち造形デザイン専門学校","H123310000543","23(愛知)"]
["ＥＬＩＣビジネス＆公務員専門学校","H123310000552","23(愛知)"]
["あいち福祉医療専門学校","H123310000561","23(愛知)"]
["名古屋ブライダルビューティー専門学校","H123310000570","23(愛知)"]
["えきさい看護専門学校","H123310000589","23(愛知)"]
["まつかげ看護専門学校","H123310000598","23(愛知)"]
["専門学校日本神学校","H123310000605","23(愛知)"]
["専門学校名古屋鍼灸学校","H123310000614","23(愛知)"]
["名古屋医健スポーツ専門学校","H123310000623","23(愛知)"]
["名古屋こども専門学校","H123310000632","23(愛知)"]
["名古屋ウェディングアンドブライダル専門学校","H123310000641","23(愛知)"]
["名古屋スクールオブミュージック＆ダンス専門学校","H123310000650","23(愛知)"]
["専修学校クラーク高等学院名古屋校","H123310000669","23(愛知)"]
["愛知芸術高等専修学校","H123310000678","23(愛知)"]
["独立行政法人労働者健康安全機構中部労災看護専門学校","H123310000687","23(愛知)"]
["専門学校日産愛知自動車大学校","H123310000696","23(愛知)"]
["名古屋市医師会看護専門学校","H123310000703","23(愛知)"]
["名古屋デザイン＆テクノロジー専門学校","H123310000712","23(愛知)"]
["名古屋ＥＣＯ動物海洋専門学校","H123310000721","23(愛知)"]
["専門学校ノースリバービジネスカレッジ","H123310000730","23(愛知)"]
["名古屋情報専門学校","H123310000758","23(愛知)"]
["東海歯科医療専門学校","H123310000767","23(愛知)"]
["八事看護専門学校","H123310000776","23(愛知)"]
["専門学校名古屋デンタル衛生士学院","H123310000785","23(愛知)"]
["東海工業専門学校金山校","H123310000794","23(愛知)"]
["愛知美容専門学校","H123310000801","23(愛知)"]
["名古屋医療情報専門学校","H123310000810","23(愛知)"]
["名古屋綜合美容専門学校","H123310000829","23(愛知)"]
["豊橋調理製菓専門学校","H123310000838","23(愛知)"]
["豊橋情報ビジネス専門学校","H123310000847","23(愛知)"]
["豊橋歯科衛生士専門学校","H123310000856","23(愛知)"]
["中部コンピュータ・パティシエ専門学校","H123310000865","23(愛知)"]
["東三河看護専門学校","H123310000874","23(愛知)"]
["あいち情報専門学校","H123310000883","23(愛知)"]
["専門学校中部ビューティ・デザイン・デンタルカレッジ","H123310000892","23(愛知)"]
["美容専門学校アーティス・ヘアー・カレッジ","H123310000909","23(愛知)"]
["豊橋准看護学校","H123310000918","23(愛知)"]
["東海医療技術専門学校","H123310000927","23(愛知)"]
["中部美容専門学校岡崎校","H123310000936","23(愛知)"]
["慈恵福祉保育専門学校","H123310000945","23(愛知)"]
["三河歯科衛生専門学校","H123310000954","23(愛知)"]
["愛知ペット専門学校","H123310000963","23(愛知)"]
["桐華家政専門学校","H123310000972","23(愛知)"]
["中部福祉保育医療専門学校","H123310000981","23(愛知)"]
["川崎服飾技芸専門学校","H123310000990","23(愛知)"]
["豊田地域看護専門学校","H123310001007","23(愛知)"]
["愛知県厚生農業協同組合連合会加茂看護専門学校","H123310001016","23(愛知)"]
["トヨタ看護専門学校","H123310001025","23(愛知)"]
["愛知工業大学情報電子専門学校","H123310001034","23(愛知)"]
["安城生活福祉高等専修学校","H123310001043","23(愛知)"]
["愛知県厚生農業協同組合連合会更生看護専門学校","H123310001052","23(愛知)"]
["慈恵歯科医療ファッション専門学校","H123310001061","23(愛知)"]
["大岡学園ファッション文化専門学校","H123310001070","23(愛知)"]
["安城市医師会安城碧海看護専門学校","H123310001089","23(愛知)"]
["西尾高等家政専門学校","H123310001098","23(愛知)"]
["西尾市医師会准看護学校","H123310001105","23(愛知)"]
["愛知県厚生農業協同組合連合会愛北看護専門学校","H123310001114","23(愛知)"]
["愛知中央美容専門学校","H123310001123","23(愛知)"]
["穂の香看護専門学校","H123310001132","23(愛知)"]
["山本学園情報文化専門学校","H123310001141","23(愛知)"]
["中部ファッション専門学校","H123310001150","23(愛知)"]
["中部製菓専門学校","H123310001169","23(愛知)"]
["専門学校愛知保健看護大学校","H123310001187","23(愛知)"]
["専門学校トヨタ名古屋自動車大学校","H123310001196","23(愛知)"]
["名鉄自動車専門学校","H123310001203","23(愛知)"]
["尾北看護専門学校","H123310001212","23(愛知)"]
["愛知自動車整備専門学校","H123310001221","23(愛知)"]
["名古屋栄養専門学校","H123310001230","23(愛知)"]
["名古屋ファッション専門学校","H123310001249","23(愛知)"]
["広告デザイン専門学校","H123310001258","23(愛知)"]
["専門学校名古屋スクール・オブ・ビジネス","H123310001267","23(愛知)"]
["日本福祉大学中央福祉専門学校","H123310001276","23(愛知)"]
["名古屋観光専門学校","H123310001285","23(愛知)"]
["中部美容専門学校名古屋校","H123310001294","23(愛知)"]
["保育・介護・ビジネス名古屋専門学校","H123310001301","23(愛知)"]
["国際製菓技術専門学校","H123310001310","23(愛知)"]
["専修学校さつき調理福祉学院","H123310001329","23(愛知)"]
["トライデントコンピュータ専門学校","H123310001338","23(愛知)"]
["ＨＡＬ名古屋","H123310001347","23(愛知)"]
["トライデントデザイン専門学校","H123310001356","23(愛知)"]
["中部看護専門学校","H123310001365","23(愛知)"]
["名古屋未来工科専門学校","H123310001374","23(愛知)"]
["大原トラベル・ホテル・ブライダル専門学校","H123310001383","23(愛知)"]
["大原法律公務員専門学校","H123310001392","23(愛知)"]
["専門学校日本聴能言語福祉学院","H123310001409","23(愛知)"]
["東京法律公務員専門学校名古屋校","H123310001418","23(愛知)"]
["東京ＩＴプログラミング＆会計専門学校名古屋校","H123310001427","23(愛知)"]
["専門学校セントラルトリミングアカデミー","H123310001436","23(愛知)"]
["名古屋外語・ホテル・ブライダル専門学校","H123310001454","23(愛知)"]
["名古屋平成看護医療専門学校","H123310001463","23(愛知)"]
["理学・作業名古屋専門学校","H123310001472","23(愛知)"]
["名古屋ユマニテク歯科衛生専門学校","H123310001481","23(愛知)"]
["名古屋動物専門学校","H123310001490","23(愛知)"]
["ニュートン高等専修学校","H123310001506","23(愛知)"]
["国際医学技術専門学校","H123310001515","23(愛知)"]
["名古屋リゾートアンドスポーツ専門学校","H123310001524","23(愛知)"]
["名古屋ビューティーアート専門学校","H123310001533","23(愛知)"]
["名古屋スイーツアンドカフェ専門学校","H123310001542","23(愛知)"]
["名古屋辻学園調理専門学校","H123310001551","23(愛知)"]
["名古屋製菓専門学校","H123310001560","23(愛知)"]
["名古屋農業園芸・食テクノロジー専門学校","H123310001579","23(愛知)"]
["東海医療工学専門学校","H123310001588","23(愛知)"]
["ＦＴＳビジネス専門学校","H123310001597","23(愛知)"]
["セブンティーン美容専門学校","H123310001604","23(愛知)"]
["田原福祉グローバル専門学校","H123310001613","23(愛知)"]
["理知の杜ビジネス専門学校","H123310001622","23(愛知)"]
["名古屋理容美容専門学校","H123310001631","23(愛知)"]
["三重県立公衆衛生学院","H124220180019","24(三重)"]
["三重県農業大学校","H124220480016","24(三重)"]
["名張市立看護専門学校","H124220880012","24(三重)"]
["三重調理専門学校","H124320185012","24(三重)"]
["津文化服装専門学校","H124320185021","24(三重)"]
["旭美容専門学校","H124320185030","24(三重)"]
["独法国立病院機構三重中央医療センター附属三重中央看護学校","H124320185049","24(三重)"]
["津看護専門学校","H124320185058","24(三重)"]
["三重介護福祉専門学校","H124320185067","24(三重)"]
["三重看護専門学校","H124320185076","24(三重)"]
["大原簿記医療観光専門学校津校","H124320185085","24(三重)"]
["大原法律公務員専門学校津校","H124320185094","24(三重)"]
["ユマニテクライフデザイン専門学校","H124320285011","24(三重)"]
["中部ライテクビジネス専門学校","H124320285020","24(三重)"]
["中部調理製菓専門学校","H124320285039","24(三重)"]
["専門学校ミエ・ヘア・アーチストアカデミー","H124320285048","24(三重)"]
["四日市情報外語専門学校","H124320285057","24(三重)"]
["中部水耕栽培福祉専門学校","H124320285066","24(三重)"]
["四日市福祉専門学校","H124320285075","24(三重)"]
["ユマニテク看護助産専門学校","H124320285084","24(三重)"]
["ユマニテク調理製菓専門学校","H124320285093","24(三重)"]
["四日市医師会看護専門学校","H124320285100","24(三重)"]
["専門学校ユマニテク医療福祉大学校","H124320285119","24(三重)"]
["英心専門学校","H124320385010","24(三重)"]
["伊勢調理製菓専門学校","H124320385029","24(三重)"]
["伊勢保健衛生専門学校","H124320385038","24(三重)"]
["勢京ビジネス専門学校","H124320385047","24(三重)"]
["伊勢理容美容専門学校","H124320385056","24(三重)"]
["伊勢志摩リハビリテーション専門学校","H124320385065","24(三重)"]
["松阪看護専門学校","H124320485019","24(三重)"]
["桑名文化専門学校","H124320585018","24(三重)"]
["桑名医師会立桑名看護専門学校","H124320585027","24(三重)"]
["鈴鹿オフィスワーク医療福祉専門学校","H124320785016","24(三重)"]
["徳風技能専門学校","H124321085011","24(三重)"]
["社会医療法人畿内会岡波看護専門学校","H124321685015","24(三重)"]
["聖十字看護専門学校","H124334185013","24(三重)"]
["滋賀県立看護専門学校","H125220300013","25(滋賀)"]
["滋賀県立農業大学校","H125220400012","25(滋賀)"]
["滋賀県立総合保健専門学校","H125220700019","25(滋賀)"]
["大津文化ビジネス高等専修学校","H125320100013","25(滋賀)"]
["大津赤十字看護専門学校","H125320100022","25(滋賀)"]
["近江時計眼鏡宝飾専門学校","H125320100031","25(滋賀)"]
["華頂看護専門学校","H125320100040","25(滋賀)"]
["叡山学院","H125320100059","25(滋賀)"]
["大津市医師会立看護専修学校","H125320100068","25(滋賀)"]
["滋賀県堅田看護専門学校","H125320100077","25(滋賀)"]
["華頂社会福祉専門学校","H125320100086","25(滋賀)"]
["国際経営情報専門学校","H125320100095","25(滋賀)"]
["スワン服飾専門学校","H125320200012","25(滋賀)"]
["辻服飾専修学校","H125320600018","25(滋賀)"]
["草津看護専門学校","H125320600027","25(滋賀)"]
["滋賀県済生会看護専門学校","H125320800016","25(滋賀)"]
["向陽台水口専門学校","H125320900015","25(滋賀)"]
["ルネス紅葉スポーツ柔整専門学校","H125320900024","25(滋賀)"]
["甲賀看護専門学校","H125320900033","25(滋賀)"]
["タキイ研究農場付属園芸専門学校","H125321100011","25(滋賀)"]
["滋賀情報専門学校","H125321300019","25(滋賀)"]
["淡海書道文化専門学校","H125321300028","25(滋賀)"]
["京都府立視力障害者福祉センター","H126210000016","26(京都)"]
["市立福知山市民病院附属看護学校","H126210000025","26(京都)"]
["京都中部総合医療センター看護専門学校","H126210000034","26(京都)"]
["京都府立看護学校","H126210000043","26(京都)"]
["京都第一赤十字看護専門学校","H126310000014","26(京都)"]
["京都第二赤十字看護専門学校","H126310000023","26(京都)"]
["京都調理師専門学校","H126310000032","26(京都)"]
["京都栄養医療専門学校","H126310000041","26(京都)"]
["裏千家学園茶道専門学校","H126310000050","26(京都)"]
["京都ＹＭＣＡ国際福祉専門学校","H126310000069","26(京都)"]
["京都建築専門学校","H126310000078","26(京都)"]
["京都川上服飾専門学校","H126310000087","26(京都)"]
["ニット・ファッション専門学校","H126310000096","26(京都)"]
["京都バレエ専門学校","H126310000103","26(京都)"]
["京都保健衛生専門学校","H126310000112","26(京都)"]
["近畿高等看護専門学校","H126310000121","26(京都)"]
["京都コンピュータ学院洛北校","H126310000130","26(京都)"]
["佛立教育専門学校","H126310000149","26(京都)"]
["京都歯科医療技術専門学校","H126310000158","26(京都)"]
["京都府医師会看護専門学校","H126310000167","26(京都)"]
["京都桂看護専門学校","H126310000176","26(京都)"]
["アミューズ美容専門学校","H126310000185","26(京都)"]
["京都衛生専門学校","H126310000194","26(京都)"]
["嵯峨華道専門学校","H126310000201","26(京都)"]
["京都コンピュータ学院鴨川校","H126310000210","26(京都)"]
["福知山医師会看護高等専修学校","H126310000229","26(京都)"]
["京都保育福祉専門学院","H126310000238","26(京都)"]
["京都コンピュータ技術専門学校","H126310000247","26(京都)"]
["京都理容美容専修学校","H126310000256","26(京都)"]
["駿台予備学校京都校","H126310000265","26(京都)"]
["京都府看護専修学校","H126310000274","26(京都)"]
["京都芸術デザイン専門学校","H126310000283","26(京都)"]
["（専）京都中央看護保健大学校","H126310000292","26(京都)"]
["＜専＞ＹＩＣ京都工科自動車大学校","H126310000309","26(京都)"]
["京都コンピュータ学院京都駅前校","H126310000318","26(京都)"]
["洛和会京都厚生学校","H126310000327","26(京都)"]
["京都自動車専門学校","H126310000336","26(京都)"]
["京都デザイン専門学校","H126310000345","26(京都)"]
["専門学校日産京都自動車大学校","H126310000363","26(京都)"]
["京都ホテル観光ブライダル専門学校","H126310000372","26(京都)"]
["＜専＞京都建築大学校","H126310000381","26(京都)"]
["京都医療福祉専門学校","H126310000390","26(京都)"]
["京都福祉専門学校","H126310000407","26(京都)"]
["池坊文化学院","H126310000416","26(京都)"]
["京都動物専門学校","H126310000425","26(京都)"]
["京都製菓製パン技術専門学校","H126310000434","26(京都)"]
["京都美容専門学校","H126310000443","26(京都)"]
["京都外国語専門学校","H126310000452","26(京都)"]
["〈専〉京都伝統工芸大学校","H126310000461","26(京都)"]
["大原簿記ビジネス公務員専門学校京都校","H126310000470","26(京都)"]
["京都公務員＆ＩＴ会計専門学校","H126310000489","26(京都)"]
["京都医健専門学校","H126310000498","26(京都)"]
["京都歯科衛生学院専門学校","H126310000504","26(京都)"]
["京都仏眼鍼灸理療専門学校","H126310000513","26(京都)"]
["ＹＩＣ京都ビューティ専門学校","H126310000522","26(京都)"]
["京都文化医療専門学校","H126310000531","26(京都)"]
["ＹＩＣ京都ペット総合専門学校","H126310000540","26(京都)"]
["独立行政法人国立病院機構京都医療センター附属京都看護助産学校","H126310000559","26(京都)"]
["舞鶴医療センター附属看護学校","H126310000568","26(京都)"]
["舞鶴ＹＭＣＡ国際福祉専門学校","H126310000577","26(京都)"]
["京都近畿情報高等専修学校","H126310000586","26(京都)"]
["京都デザイン＆テクノロジー専門学校","H126310000595","26(京都)"]
["大阪大学歯学部附属歯科技工士学校","H127110000017","27(大阪)"]
["大阪市立デザイン教育研究所","H127210000015","27(大阪)"]
["関西テレビ電気専門学校","H127310000013","27(大阪)"]
["大阪コンピュータ専門学校","H127310000022","27(大阪)"]
["大阪建設専門学校","H127310000031","27(大阪)"]
["上田安子服飾専門学校","H127310000040","27(大阪)"]
["関西経理専門学校","H127310000059","27(大阪)"]
["大阪モード学園","H127310000068","27(大阪)"]
["大阪電子専門学校","H127310000077","27(大阪)"]
["日本医療秘書専門学校","H127310000086","27(大阪)"]
["大阪赤十字看護専門学校","H127310000095","27(大阪)"]
["マロニエファッションデザイン専門学校","H127310000102","27(大阪)"]
["修成建設専門学校","H127310000111","27(大阪)"]
["大阪教育福祉専門学校","H127310000120","27(大阪)"]
["関西外語専門学校","H127310000139","27(大阪)"]
["中央学園高等専修学校","H127310000148","27(大阪)"]
["大阪文化服装学院","H127310000157","27(大阪)"]
["大阪ファッションアート専門学校","H127310000175","27(大阪)"]
["行岡医学技術専門学校","H127310000184","27(大阪)"]
["関西医療学園専門学校","H127310000193","27(大阪)"]
["南大阪看護専門学校","H127310000200","27(大阪)"]
["大阪工業技術専門学校","H127310000219","27(大阪)"]
["日本写真映像専門学校","H127310000228","27(大阪)"]
["グラムール美容専門学校","H127310000237","27(大阪)"]
["関西美容専門学校","H127310000246","27(大阪)"]
["東朋高等専修学校","H127310000255","27(大阪)"]
["一般社団法人大阪府歯科医師会附属歯科衛生士専門学校","H127310000264","27(大阪)"]
["ビジュアルアーツ専門学校","H127310000273","27(大阪)"]
["英風女子高等専修学校","H127310000282","27(大阪)"]
["大阪歯科学院専門学校","H127310000291","27(大阪)"]
["森ノ宮医療学園専門学校","H127310000308","27(大阪)"]
["日本理工情報専門学校","H127310000317","27(大阪)"]
["アイム近畿理容美容専門学校","H127310000335","27(大阪)"]
["高津理容美容専門学校","H127310000344","27(大阪)"]
["大阪デザイナー専門学校","H127310000353","27(大阪)"]
["大阪済生会中津看護専門学校","H127310000362","27(大阪)"]
["大阪病院附属看護専門学校","H127310000371","27(大阪)"]
["大阪美容専門学校","H127310000399","27(大阪)"]
["大阪歯科衛生士専門学校","H127310000406","27(大阪)"]
["ＮＲＢ日本理容美容専門学校","H127310000415","27(大阪)"]
["近畿測量専門学校","H127310000424","27(大阪)"]
["小出美容専門学校","H127310000433","27(大阪)"]
["東洋学園高等専修学校","H127310000442","27(大阪)"]
["創造社デザイン専門学校","H127310000451","27(大阪)"]
["大阪総合デザイン専門学校","H127310000460","27(大阪)"]
["辻調理師専門学校","H127310000488","27(大阪)"]
["大阪ＹＭＣＡ国際専門学校","H127310000497","27(大阪)"]
["公益財団法人浅香山病院看護専門学校","H127310000503","27(大阪)"]
["明治東洋医学院専門学校","H127310000512","27(大阪)"]
["桂ｍａｋｅ－ｕｐデザイン専門学校","H127310000530","27(大阪)"]
["清恵会医療専門学院","H127310000549","27(大阪)"]
["八洲学園高等専修学校","H127310000558","27(大阪)"]
["清恵会第二医療専門学院","H127310000567","27(大阪)"]
["泉州看護専門学校","H127310000576","27(大阪)"]
["独立行政法人労働者健康安全機構大阪労災看護専門学校","H127310000585","27(大阪)"]
["岸和田市医師会看護専門学校","H127310000594","27(大阪)"]
["泉大津市医師会附属看護高等専修学校","H127310000601","27(大阪)"]
["河﨑会看護専門学校","H127310000610","27(大阪)"]
["ピーエル学園衛生看護専門学校","H127310000629","27(大阪)"]
["専門学校ベルランド看護助産大学校","H127310000638","27(大阪)"]
["鴻池学園高等専修学校","H127310000647","27(大阪)"]
["箕面学園福祉保育専門学校","H127310000656","27(大阪)"]
["南海福祉看護専門学校","H127310000665","27(大阪)"]
["北斗会看護専門学校","H127310000674","27(大阪)"]
["パナソニック健康保険組合立松下看護専門学校","H127310000683","27(大阪)"]
["大精協看護専門学校","H127310000692","27(大阪)"]
["阪和鳳自動車工業専門学校","H127310000709","27(大阪)"]
["駿台観光アンド外語ビジネス専門学校","H127310000718","27(大阪)"]
["愛仁会看護助産専門学校","H127310000727","27(大阪)"]
["関西看護専門学校","H127310000736","27(大阪)"]
["香里ヶ丘看護専門学校","H127310000745","27(大阪)"]
["日本歯科学院専門学校","H127310000754","27(大阪)"]
["日本医療学院専門学校","H127310000763","27(大阪)"]
["ホンダテクニカルカレッジ関西","H127310000772","27(大阪)"]
["大阪調理製菓専門学校","H127310000781","27(大阪)"]
["美原看護専門学校","H127310000790","27(大阪)"]
["近畿情報高等専修学校","H127310000807","27(大阪)"]
["大阪技能専門学校","H127310000816","27(大阪)"]
["堺看護専門学校","H127310000825","27(大阪)"]
["近畿コンピュータ電子専門学校","H127310000834","27(大阪)"]
["大阪保育福祉専門学校","H127310000843","27(大阪)"]
["久米田看護専門学校","H127310000852","27(大阪)"]
["堺歯科衛生士専門学校","H127310000861","27(大阪)"]
["ユービック情報専門学校","H127310000870","27(大阪)"]
["四条畷看護専門学校","H127310000889","27(大阪)"]
["小阪病院看護専門学校","H127310000898","27(大阪)"]
["大阪航空専門学校","H127310000905","27(大阪)"]
["高槻市医師会看護学校","H127310000914","27(大阪)"]
["鴻池生活科学専門学校","H127310000923","27(大阪)"]
["大阪総合福祉専門学校","H127310000932","27(大阪)"]
["泉佐野泉南医師会看護専門学校","H127310000941","27(大阪)"]
["大阪アニメーションカレッジ専門学校","H127310000950","27(大阪)"]
["独立行政法人国立病院機構大阪南医療センター附属大阪南看護学校","H127310000969","27(大阪)"]
["国際東洋医療学院","H127310000978","27(大阪)"]
["医療法人髙寿会近畿リハビリテーション学院","H127310000987","27(大阪)"]
["大阪医療看護専門学校","H127310000996","27(大阪)"]
["履正社スポーツ専門学校北大阪校","H127310001003","27(大阪)"]
["国際ビジネスデザイン専門学校","H127310001012","27(大阪)"]
["辻学園調理・製菓専門学校","H127310001021","27(大阪)"]
["大阪外語専門学校","H127310001030","27(大阪)"]
["大阪情報専門学校","H127310001049","27(大阪)"]
["東洋きもの専門学校","H127310001058","27(大阪)"]
["大阪芸術大学附属大阪美術専門学校","H127310001067","27(大阪)"]
["大原簿記専門学校大阪校","H127310001076","27(大阪)"]
["大阪ビジネスカレッジ専門学校","H127310001085","27(大阪)"]
["日本分析化学専門学校","H127310001094","27(大阪)"]
["大阪ＹＷＣＡ専門学校","H127310001101","27(大阪)"]
["淀川区医師会看護専門学校","H127310001110","27(大阪)"]
["大阪医療技術学園専門学校","H127310001129","27(大阪)"]
["ル・トーア東亜美容専門学校","H127310001138","27(大阪)"]
["大阪社体スポーツ専門学校","H127310001147","27(大阪)"]
["エール学園","H127310001156","27(大阪)"]
["ＨＡＬ大阪","H127310001165","27(大阪)"]
["太成学院大学歯科衛生専門学校","H127310001174","27(大阪)"]
["大阪コミュニティワーカー専門学校","H127310001183","27(大阪)"]
["ＥＣＣ国際外語専門学校","H127310001192","27(大阪)"]
["日本コンピュータ専門学校","H127310001209","27(大阪)"]
["大阪観光専門学校","H127310001218","27(大阪)"]
["辻学園栄養専門学校","H127310001227","27(大阪)"]
["大阪ベルェベル美容専門学校","H127310001236","27(大阪)"]
["中央工学校ＯＳＡＫＡ","H127310001245","27(大阪)"]
["なにわ歯科衛生専門学校","H127310001254","27(大阪)"]
["大阪府病院協会看護専門学校","H127310001263","27(大阪)"]
["関西情報工学院専門学校","H127310001272","27(大阪)"]
["大阪アミューズメントメディア専門学校","H127310001281","27(大阪)"]
["愛甲農業科学専門学校","H127310001290","27(大阪)"]
["大阪情報コンピュータ専門学校","H127310001307","27(大阪)"]
["辻製菓専門学校","H127310001325","27(大阪)"]
["大阪調理製菓専門学校ｅｃｏｌｅＵＭＥＤＡ","H127310001334","27(大阪)"]
["新大阪歯科技工士専門学校","H127310001343","27(大阪)"]
["大阪ハイテクノロジー専門学校","H127310001352","27(大阪)"]
["ホスピタリティツーリズム専門学校大阪","H127310001361","27(大阪)"]
["キャットミュージックカレッジ専門学校","H127310001370","27(大阪)"]
["清風情報工科学院","H127310001389","27(大阪)"]
["大阪行岡医療専門学校長柄校","H127310001398","27(大阪)"]
["中央ＩＴビジネス専門学校","H127310001405","27(大阪)"]
["大阪スクールオブミュージック専門学校","H127310001414","27(大阪)"]
["ＯＣＡ大阪デザイン＆ＩＴテクノロジー専門学校","H127310001423","27(大阪)"]
["履正社国際医療スポーツ専門学校","H127310001432","27(大阪)"]
["日本モータースポーツ専門学校大阪校","H127310001441","27(大阪)"]
["大阪動植物海洋専門学校","H127310001450","27(大阪)"]
["大阪ＩＴプログラミング＆会計専門学校","H127310001469","27(大阪)"]
["大阪法律公務員専門学校","H127310001478","27(大阪)"]
["大阪国際福祉専門学校","H127310001487","27(大阪)"]
["大阪医療秘書福祉専門学校","H127310001496","27(大阪)"]
["関西社会福祉専門学校","H127310001502","27(大阪)"]
["日本メディカル福祉専門学校","H127310001511","27(大阪)"]
["大阪情報コンピュータ高等専修学校","H127310001520","27(大阪)"]
["大阪リゾートアンドスポーツ専門学校","H127310001539","27(大阪)"]
["大阪済生会野江看護専門学校","H127310001548","27(大阪)"]
["近畿社会福祉専門学校","H127310001557","27(大阪)"]
["阪奈中央リハビリテーション専門学校","H127310001566","27(大阪)"]
["大阪社会福祉専門学校","H127310001575","27(大阪)"]
["大阪健康ほいく専門学校","H127310001584","27(大阪)"]
["近畿大学附属看護専門学校","H127310001593","27(大阪)"]
["北大阪福祉専門学校","H127310001600","27(大阪)"]
["大阪保健福祉専門学校","H127310001619","27(大阪)"]
["ＥＣＣコンピュータ専門学校","H127310001628","27(大阪)"]
["専修学校夕陽丘予備校","H127310001637","27(大阪)"]
["大阪中央理容美容専門学校","H127310001646","27(大阪)"]
["大原法律公務員＆スポーツ専門学校大阪校","H127310001655","27(大阪)"]
["大阪自動車整備専門学校","H127310001664","27(大阪)"]
["大阪ペピイ動物看護専門学校","H127310001673","27(大阪)"]
["東洋医療専門学校","H127310001682","27(大阪)"]
["大阪リハビリテーション専門学校","H127310001691","27(大阪)"]
["大阪医専","H127310001708","27(大阪)"]
["大阪保育こども教育専門学校","H127310001717","27(大阪)"]
["平成医療学園専門学校","H127310001726","27(大阪)"]
["大阪医療福祉専門学校","H127310001735","27(大阪)"]
["大原簿記法律専門学校難波校","H127310001744","27(大阪)"]
["大阪情報ＩＴクリエイター専門学校","H127310001753","27(大阪)"]
["新大阪歯科衛生士専門学校","H127310001762","27(大阪)"]
["大阪ビューティーアート専門学校","H127310001771","27(大阪)"]
["ヴェールルージュ美容専門学校","H127310001780","27(大阪)"]
["ＥＣＣアーティスト美容専門学校","H127310001799","27(大阪)"]
["メディカルエステ専門学校","H127310001815","27(大阪)"]
["大原簿記法律専門学校梅田校","H127310001824","27(大阪)"]
["大原医療福祉製菓専門学校梅田校","H127310001833","27(大阪)"]
["大阪バイオメディカル専門学校","H127310001842","27(大阪)"]
["独立行政法人国立病院機構大阪医療センター附属看護学校","H127310001851","27(大阪)"]
["専修学校クラーク高等学院天王寺校","H127310001860","27(大阪)"]
["大阪ＩＴプログラミング＆会計専門学校天王寺校","H127310001879","27(大阪)"]
["大阪法律公務員専門学校天王寺校","H127310001888","27(大阪)"]
["理容美容専門学校西日本ヘアメイクカレッジ","H127310001897","27(大阪)"]
["代々木ゼミナール大阪南専修学校","H127310001904","27(大阪)"]
["専門学校ＥＳＰエンタテインメント大阪","H127310001913","27(大阪)"]
["関西医科専門学校","H127310001922","27(大阪)"]
["関西ビューティプロ専門学校","H127310001931","27(大阪)"]
["大阪ダンス・俳優＆舞台芸術専門学校","H127310001940","27(大阪)"]
["大阪動物専門学校","H127310001959","27(大阪)"]
["大阪こども専門学校","H127310001968","27(大阪)"]
["ミス・パリエステティック専門学校","H127310001977","27(大阪)"]
["専門学校ヒコ・みづのジュエリーカレッジ大阪","H127310001986","27(大阪)"]
["大阪動物専門学校天王寺校","H127310001995","27(大阪)"]
["近畿医療専門学校","H127310002002","27(大阪)"]
["大原スポーツ＆メディカルヘルス専門学校難波校","H127310002011","27(大阪)"]
["大阪歯科衛生学院専門学校","H127310002020","27(大阪)"]
["大原外語観光＆ブライダルビューティー専門学校","H127310002039","27(大阪)"]
["大阪府柔道整復師会専門学校","H127310002048","27(大阪)"]
["大阪ブライダル専門学校","H127310002057","27(大阪)"]
["大阪ベルェベルビューティ＆ブライダル専門学校","H127310002066","27(大阪)"]
["大阪スクールオブミュージック高等専修学校","H127310002075","27(大阪)"]
["大阪ウェディングアンドブライダル専門学校","H127310002084","27(大阪)"]
["大阪アニメ・声優＆ｅスポーツ専門学校","H127310002093","27(大阪)"]
["放送芸術学院専門学校","H127310002100","27(大阪)"]
["小出美容専門学校大阪校","H127310002119","27(大阪)"]
["錦秀会看護専門学校","H127310002128","27(大阪)"]
["大阪エンタテイメントデザイン専門学校","H127310002137","27(大阪)"]
["大阪ＥＣＯ動物海洋専門学校","H127310002146","27(大阪)"]
["専修学校クラーク高等学院大阪梅田校","H127310002155","27(大阪)"]
["大阪ウエディング＆ホテル・ＩＲ専門学校","H127310002164","27(大阪)"]
["大阪キャリナリー製菓調理専門学校","H127310002173","27(大阪)"]
["日中文化芸術専門学校","H127310002182","27(大阪)"]
["ＥＳＡ音楽学院専門学校","H127310002191","27(大阪)"]
["大阪観光ビジネス学院","H127310002208","27(大阪)"]
["大阪ホテル専門学校","H127310002217","27(大阪)"]
["大阪テーマパーク・ダンス専門学校","H127310002226","27(大阪)"]
["大阪ブレーメン動物専門学校","H127310002235","27(大阪)"]
["大阪警察病院看護専門学校","H127310002244","27(大阪)"]
["国立神戸視力障害センター","H128110000016","28(兵庫)"]
["兵庫県立総合衛生学院","H128210000014","28(兵庫)"]
["播磨看護専門学校","H128210000023","28(兵庫)"]
["相生市看護専門学校","H128210000032","28(兵庫)"]
["公立八鹿病院看護専門学校","H128210000041","28(兵庫)"]
["宝塚市立看護専門学校","H128210000050","28(兵庫)"]
["兵庫県立農業大学校","H128210000069","28(兵庫)"]
["丹波市立看護専門学校","H128210000078","28(兵庫)"]
["兵庫県立森林大学校","H128210000087","28(兵庫)"]
["神戸電子専門学校","H128310000012","28(兵庫)"]
["姫路赤十字看護専門学校","H128310000021","28(兵庫)"]
["関西保育福祉専門学校","H128310000030","28(兵庫)"]
["専門学校アートカレッジ神戸","H128310000058","28(兵庫)"]
["伊丹高等文化学院専門学校","H128310000067","28(兵庫)"]
["大岡学園高等専修学校","H128310000076","28(兵庫)"]
["西脇家政高等専修学校","H128310000085","28(兵庫)"]
["山崎文化専門学校","H128310000094","28(兵庫)"]
["ＢＥＡＵＴＹＡＲＴＳＫＯＢＥ日本高等美容専門学校","H128310000101","28(兵庫)"]
["神戸総合医療専門学校","H128310000110","28(兵庫)"]
["専門学校テクニカルカレッジ神戸","H128310000129","28(兵庫)"]
["専門学校神戸文化服装学院","H128310000138","28(兵庫)"]
["兵庫県歯科医師会附属兵庫歯科衛生士学院","H128310000147","28(兵庫)"]
["神戸中央病院附属看護専門学校","H128310000156","28(兵庫)"]
["公益社団法人神戸市民間病院協会神戸看護専門学校","H128310000165","28(兵庫)"]
["姫路経営医療専門学校","H128310000174","28(兵庫)"]
["日本調理製菓専門学校","H128310000183","28(兵庫)"]
["公益財団法人尼崎健康医療財団看護専門学校","H128310000192","28(兵庫)"]
["木下和服裁縫専門学校","H128310000209","28(兵庫)"]
["神戸ＹＭＣＡ学院専門学校","H128310000218","28(兵庫)"]
["神戸理容美容専門学校","H128310000227","28(兵庫)"]
["東亜学園商業実務専門学校","H128310000236","28(兵庫)"]
["神戸女子洋裁専門学校","H128310000245","28(兵庫)"]
["姫路理容美容専門学校","H128310000254","28(兵庫)"]
["育成調理師専門学校","H128310000263","28(兵庫)"]
["尼崎理容美容専門学校","H128310000272","28(兵庫)"]
["平田調理専門学校","H128310000281","28(兵庫)"]
["関西労災看護専門学校","H128310000290","28(兵庫)"]
["三田モードビジネス専門学校","H128310000325","28(兵庫)"]
["日本栄養専門学校","H128310000334","28(兵庫)"]
["ビジネス専門学校キャリアカレッジ但馬","H128310000343","28(兵庫)"]
["東亜経理専門学校神戸駅前校","H128310000352","28(兵庫)"]
["神戸国際調理製菓専門学校","H128310000361","28(兵庫)"]
["興隆学林専門学校","H128310000370","28(兵庫)"]
["恵愛ソフトウェア専門学校","H128310000389","28(兵庫)"]
["専修学校クラーク高等学院芦屋校","H128310000398","28(兵庫)"]
["神戸ファッション専門学校","H128310000405","28(兵庫)"]
["姫路情報システム専門学校","H128310000414","28(兵庫)"]
["神戸動植物環境専門学校","H128310000423","28(兵庫)"]
["阪神自動車航空鉄道専門学校","H128310000432","28(兵庫)"]
["専修学校西宮甲英高等学院","H128310000441","28(兵庫)"]
["姫路福祉保育専門学校","H128310000469","28(兵庫)"]
["西神看護専門学校","H128310000478","28(兵庫)"]
["専門学校トヨタ神戸自動車大学校","H128310000487","28(兵庫)"]
["神戸医療福祉専門学校中央校","H128310000496","28(兵庫)"]
["神戸市医師会看護専門学校","H128310000502","28(兵庫)"]
["専門学校日本工科大学校","H128310000511","28(兵庫)"]
["西宮市医師会看護専門学校","H128310000520","28(兵庫)"]
["愛甲学院専門学校","H128310000539","28(兵庫)"]
["神戸医療福祉専門学校三田校","H128310000548","28(兵庫)"]
["関西野球専門学校","H128310000557","28(兵庫)"]
["大原簿記専門学校神戸校","H128310000566","28(兵庫)"]
["関西総合リハビリテーション専門学校","H128310000575","28(兵庫)"]
["神戸ベルェベル美容専門学校","H128310000584","28(兵庫)"]
["関西健康科学専門学校","H128310000593","28(兵庫)"]
["明石医療センター附属看護専門学校","H128310000600","28(兵庫)"]
["神戸製菓専門学校","H128310000619","28(兵庫)"]
["兵庫鍼灸専門学校","H128310000628","28(兵庫)"]
["姫路市医師会看護専門学校","H128310000637","28(兵庫)"]
["はくほう会医療専門学校赤穂校","H128310000646","28(兵庫)"]
["神戸リハビリテーション福祉専門学校","H128310000655","28(兵庫)"]
["アルファジャパン美容専門学校","H128310000664","28(兵庫)"]
["姫路歯科衛生専門学校","H128310000673","28(兵庫)"]
["平成リハビリテーション専門学校","H128310000682","28(兵庫)"]
["神戸こども総合専門学院","H128310000691","28(兵庫)"]
["姫路ハーベスト医療福祉専門学校","H128310000708","28(兵庫)"]
["専門学校神戸国際ビジネスカレッジ","H128310000717","28(兵庫)"]
["神戸ブレーメン動物専門学校","H128310000726","28(兵庫)"]
["専門学校東京国際ビジネスカレッジ神戸校","H128310000735","28(兵庫)"]
["はくほう会医療専門学校明石校","H128310000744","28(兵庫)"]
["姫路情報ＩＴクリエイター法律専門学校","H128310000753","28(兵庫)"]
["大原保育スポーツ医療専門学校姫路校","H128310000762","28(兵庫)"]
["ＩＣＴ専門学校","H128310000771","28(兵庫)"]
["平成淡路看護専門学校","H128310000780","28(兵庫)"]
["専修学校猪名川甲英高等学院","H128310000799","28(兵庫)"]
["神戸元町医療秘書専門学校","H128310000806","28(兵庫)"]
["神戸元町こども専門学校","H128310000815","28(兵庫)"]
["専修学校クラーク高等学院姫路校","H128310000824","28(兵庫)"]
["姫路医療専門学校","H128310000833","28(兵庫)"]
["神戸・甲陽音楽＆ダンス専門学校","H128310000842","28(兵庫)"]
["神戸・甲陽音楽ダンス＆アート高等専修学校","H128310000851","28(兵庫)"]
["関西国際旅行・ホテル専門学校","H128310000860","28(兵庫)"]
["独立行政法人国立病院機構姫路医療センター附属看護学校","H128310000879","28(兵庫)"]
["兵庫徳誠会歯科衛生士学校","H128310000888","28(兵庫)"]
["高等専修学校神戸セミナー","H128310000897","28(兵庫)"]
["大和高田市立看護専門学校","H129210000013","29(奈良)"]
["奈良市立看護専門学校","H129210000022","29(奈良)"]
["南和広域医療企業団南奈良看護専門学校","H129210000031","29(奈良)"]
["なら食と農の魅力創造国際大学校","H129210000040","29(奈良)"]
["奈良看護大学校","H129310000011","29(奈良)"]
["奈良保育学院","H129310000020","29(奈良)"]
["学校法人栗岡学園阪奈中央看護専門学校","H129310000039","29(奈良)"]
["奈良リハビリテーション専門学校","H129310000048","29(奈良)"]
["奈良高等専修学校","H129310000057","29(奈良)"]
["藤影きもの専門学校","H129310000066","29(奈良)"]
["若羽調理専門学校","H129310000075","29(奈良)"]
["奈良きもの芸術専門学校","H129310000084","29(奈良)"]
["アポロ学院ファッションビジネス専門学校","H129310000093","29(奈良)"]
["美芸学園高等専修学校","H129310000100","29(奈良)"]
["辰巳ドレスメーカー専門学校","H129310000119","29(奈良)"]
["大原和服専門学園","H129310000128","29(奈良)"]
["奈良文化専門学園","H129310000146","29(奈良)"]
["奈良コンピュータ専門学校","H129310000173","29(奈良)"]
["奈良総合ビジネス専門学校","H129310000208","29(奈良)"]
["ハートランドしぎさん看護専門学校","H129310000217","29(奈良)"]
["奈良理容美容専門学校","H129310000226","29(奈良)"]
["田北看護専門学校","H129310000235","29(奈良)"]
["奈良県医師会看護専門学校","H129310000244","29(奈良)"]
["奈良歯科衛生士専門学校","H129310000253","29(奈良)"]
["橿原美容専門学校","H129310000262","29(奈良)"]
["奈良県病院協会看護専門学校","H129310000271","29(奈良)"]
["関西学研医療福祉学院","H129310000280","29(奈良)"]
["奈良高等学園","H129310000306","29(奈良)"]
["紀南看護専門学校","H130210000010","30(和歌山)"]
["和歌山県立高等看護学院","H130210000029","30(和歌山)"]
["和歌山県立なぎ看護学校","H130210000038","30(和歌山)"]
["和歌山県農林大学校","H130210000047","30(和歌山)"]
["国保野上厚生総合病院附属看護専門学校","H130210000056","30(和歌山)"]
["日高看護専門学校","H130210000065","30(和歌山)"]
["オカファッションデザイン専門学校","H130310000027","30(和歌山)"]
["和歌山県歯科衛生士専門学校","H130310000036","30(和歌山)"]
["和歌山コンピュ－タビジネス専門学校","H130310000045","30(和歌山)"]
["学校法人平成医療学園　和歌山看護専門学校","H130310000054","30(和歌山)"]
["海南文化服装学院","H130310000063","30(和歌山)"]
["専修学校和歌山英数学館","H130310000072","30(和歌山)"]
["和歌山国際厚生学院","H130310000081","30(和歌山)"]
["大原簿記法律＆美容製菓専門学校和歌山校","H130310000090","30(和歌山)"]
["和歌山ＹＭＣＡ国際福祉専門学校","H130310000107","30(和歌山)"]
["ＩＢＷ美容専門学校","H130310000116","30(和歌山)"]
["和歌山社会福祉専門学校","H130310000125","30(和歌山)"]
["きのくに国際高等専修学校","H130310000134","30(和歌山)"]
["和歌山市医師会看護専門学校","H130310000143","30(和歌山)"]
["和歌山グローバルビジネスカレッジ","H130310000152","30(和歌山)"]
["大原情報医療保育専門学校和歌山校","H130310000161","30(和歌山)"]
["和歌山高等美容専門学校","H130310000170","30(和歌山)"]
["鳥取県立鳥取看護専門学校","H131210000019","31(鳥取)"]
["鳥取県立倉吉総合看護専門学校","H131210000028","31(鳥取)"]
["鳥取県立歯科衛生専門学校","H131210000037","31(鳥取)"]
["鳥取県立農業大学校","H131210000046","31(鳥取)"]
["鳥取県理容美容専門学校","H131310000017","31(鳥取)"]
["鳥取県東部医師会附属鳥取看護高等専修学校","H131310000026","31(鳥取)"]
["若葉学習会専修学校","H131310000035","31(鳥取)"]
["倉吉女子洋裁専修学校","H131310000044","31(鳥取)"]
["米子ファッションビジネス学園","H131310000053","31(鳥取)"]
["鳥取歯科技工専門学校","H131310000062","31(鳥取)"]
["米子文化服装専門学校","H131310000071","31(鳥取)"]
["日本海情報ビジネス専門学校","H131310000099","31(鳥取)"]
["ＹＭＣＡ米子医療福祉専門学校","H131310000106","31(鳥取)"]
["鳥取社会福祉専門学校","H131310000115","31(鳥取)"]
["あすなろ予備校","H131310000124","31(鳥取)"]
["独立行政法人国立病院機構米子医療センター附属看護学校","H131310000142","31(鳥取)"]
["中央高等学園専修学校","H131310000151","31(鳥取)"]
["あすなろ高等専修学校","H131310000160","31(鳥取)"]
["鳥取市医療看護専門学校","H131310000179","31(鳥取)"]
["専修学校鳥取予備校","H131310000188","31(鳥取)"]
["島根県立松江高等看護学院","H132220100016","32(島根)"]
["島根県立石見高等看護学院","H132220400022","32(島根)"]
["松江栄養調理製菓専門学校","H132320100032","32(島根)"]
["松江理容美容専門大学校","H132320100041","32(島根)"]
["専門学校坪内総合ビジネスカレッジ","H132320100050","32(島根)"]
["松江総合医療専門学校","H132320100112","32(島根)"]
["松江看護高等専修学校","H132320100121","32(島根)"]
["島根県歯科技術専門学校","H132320100130","32(島根)"]
["松江女子専修学校","H132320100210","32(島根)"]
["浜田ビューティーカレッジ","H132320200068","32(島根)"]
["リハビリテーションカレッジ島根","H132320200157","32(島根)"]
["浜田医療センター附属看護学校","H132320200175","32(島根)"]
["出雲コアカレッジ","H132320300076","32(島根)"]
["トリニティカレッジ出雲医療福祉専門学校","H132320300101","32(島根)"]
["出雲医療看護専門学校","H132320300192","32(島根)"]
["出雲洋裁専門学校","H132320300209","32(島根)"]
["島根総合福祉専門学校","H132320600162","32(島根)"]
["島根デザイン専門学校","H132334300095","32(島根)"]
["島根リハビリテーション学院","H132334300148","32(島根)"]
["国立療養所長島愛生園附属看護学校","H133110000019","33(岡山)"]
["岡山県農林水産総合センター農業大学校","H133210000017","33(岡山)"]
["専門学校岡山ファッションスクール","H133310000015","33(岡山)"]
["岡山服飾ビジネス専門学校","H133310000024","33(岡山)"]
["岡山理科大学専門学校","H133310000033","33(岡山)"]
["岡山赤十字看護専門学校","H133310000042","33(岡山)"]
["岡山済生会看護専門学校","H133310000051","33(岡山)"]
["文化服装専門学校","H133310000060","33(岡山)"]
["旭川荘厚生専門学院","H133310000079","33(岡山)"]
["中国デザイン専門学校","H133310000088","33(岡山)"]
["岡山労災看護専門学校","H133310000097","33(岡山)"]
["岡山医療福祉専門学校","H133310000104","33(岡山)"]
["岡山県理容美容専門学校","H133310000113","33(岡山)"]
["岡山歯科技工専門学院","H133310000122","33(岡山)"]
["専門学校ビーマックス","H133310000131","33(岡山)"]
["西日本調理製菓専門学校","H133310000140","33(岡山)"]
["専門学校岡山ビジネスカレッジ","H133310000159","33(岡山)"]
["専門学校岡山情報ビジネス学院","H133310000168","33(岡山)"]
["岡山科学技術専門学校","H133310000177","33(岡山)"]
["岡山高等歯科衛生専門学院","H133310000186","33(岡山)"]
["専門学校ワールドオプティカルカレッジ","H133310000195","33(岡山)"]
["岡山医療技術専門学校","H133310000202","33(岡山)"]
["ソワニエ看護専門学校","H133310000211","33(岡山)"]
["岡山商科大学専門学校","H133310000220","33(岡山)"]
["専修学校自由高等学院","H133310000239","33(岡山)"]
["朝日医療大学校","H133310000248","33(岡山)"]
["専門学校岡山ビューティモード","H133310000257","33(岡山)"]
["旭川荘厚生専門学院吉井川キャンパス","H133310000266","33(岡山)"]
["独立行政法人国立病院機構岡山医療センター附属岡山看護助産学校","H133310000275","33(岡山)"]
["岡山プロフェッショナル・ビューティ専門学校","H133310000284","33(岡山)"]
["インターナショナル岡山歯科衛生専門学校","H133310000293","33(岡山)"]
["専門学校倉敷ファッションカレッジ","H133310000300","33(岡山)"]
["山内服装専門学校","H133310000319","33(岡山)"]
["倉敷中央看護専門学校","H133310000328","33(岡山)"]
["倉敷看護専門学校","H133310000355","33(岡山)"]
["専門学校川崎リハビリテーション学院","H133310000364","33(岡山)"]
["専門学校倉敷ビューティーカレッジ","H133310000373","33(岡山)"]
["くらしき総合福祉専門学校","H133310000382","33(岡山)"]
["津山服装専門学校","H133310000391","33(岡山)"]
["津山中央看護専門学校","H133310000408","33(岡山)"]
["玉野総合医療専門学校","H133310000417","33(岡山)"]
["新見女子専門学校","H133310000426","33(岡山)"]
["順正高等看護福祉専門学校","H133310000435","33(岡山)"]
["専門学校岡山自動車大学校","H133310000444","33(岡山)"]
["専門学校倉敷リハビリテーション学院","H133310000462","33(岡山)"]
["関西書道専門学校","H133310000471","33(岡山)"]
["中国四国酪農大学校","H133310000480","33(岡山)"]
["岡山・建部医療福祉専門学校","H133310000499","33(岡山)"]
["日本ＩＴビジネスカレッジ","H133310000505","33(岡山)"]
["美作市スポーツ医療看護専門学校","H133310000514","33(岡山)"]
["大原ビジネス公務員専門学校岡山校","H133310000523","33(岡山)"]
["岡山情報ＩＴクリエイター専門学校","H133310000532","33(岡山)"]
["広島市立看護専門学校","H134210000016","34(広島)"]
["広島県立三次看護専門学校","H134210000025","34(広島)"]
["広島県立農業技術大学校","H134210000034","34(広島)"]
["広島情報ビジネス専門学校","H134310000014","34(広島)"]
["広島酔心調理製菓専門学校","H134310000032","34(広島)"]
["小井手ファッションビューティ専門学校","H134310000041","34(広島)"]
["広島コンピュータ専門学校","H134310000050","34(広島)"]
["広島服飾専門学校","H134310000069","34(広島)"]
["広島市医師会看護専門学校","H134310000078","34(広島)"]
["広島会計学院専門学校","H134310000087","34(広島)"]
["広島舟入商業高等専修学校","H134310000096","34(広島)"]
["広島県理容美容専門学校","H134310000103","34(広島)"]
["広島高等歯科衛生士専門学校","H134310000112","34(広島)"]
["広島Ｌａｗ＆Ｂｕｓｉｎｅｓｓ専門学校","H134310000121","34(広島)"]
["広島ＹＭＣＡ専門学校","H134310000130","34(広島)"]
["広島工業大学専門学校","H134310000149","34(広島)"]
["広島会計学院ビジネス専門学校","H134310000158","34(広島)"]
["広島外語専門学校","H134310000167","34(広島)"]
["中川学園広島総合教育専門学校","H134310000176","34(広島)"]
["専門学校西広島福祉学院","H134310000185","34(広島)"]
["広島情報専門学校","H134310000194","34(広島)"]
["専門学校西広島教育福祉学院","H134310000201","34(広島)"]
["ヒューマンウェルフェア広島専門学校","H134310000210","34(広島)"]
["専門学校広島工学院大学校","H134310000229","34(広島)"]
["トリニティカレッジ広島医療福祉専門学校","H134310000238","34(広島)"]
["専門学校マインドビューティーカレッジ","H134310000247","34(広島)"]
["広島医療保健専門学校","H134310000256","34(広島)"]
["広島美容専門学校","H134310000265","34(広島)"]
["ＩＧＬ医療福祉専門学校","H134310000274","34(広島)"]
["広島アニマルケア専門学校","H134310000283","34(広島)"]
["広島国際医療福祉専門学校","H134310000292","34(広島)"]
["広島デンタルアカデミー専門学校","H134310000309","34(広島)"]
["朝日医療専門学校広島校","H134310000318","34(広島)"]
["ＭＳＨ医療専門学校","H134310000327","34(広島)"]
["広島公務員専門学校","H134310000336","34(広島)"]
["広島ビューティーアンドブライダル専門学校","H134310000345","34(広島)"]
["広島リゾートアンドスポーツ専門学校","H134310000354","34(広島)"]
["広島医療秘書こども専門学校","H134310000363","34(広島)"]
["穴吹デザイン専門学校","H134310000372","34(広島)"]
["専門学校広島国際学院自動車整備大学校","H134310000381","34(広島)"]
["国家公務員共済組合連合会呉共済病院看護専門学校","H134310000390","34(広島)"]
["呉市医師会看護専門学校","H134310000407","34(広島)"]
["三原看護高等専修学校","H134310000416","34(広島)"]
["三原看護専門学校","H134310000425","34(広島)"]
["ひかり服装専門学校","H134310000434","34(広島)"]
["尾道市医師会看護専門学校","H134310000443","34(広島)"]
["広島県厚生連尾道看護専門学校","H134310000452","34(広島)"]
["尾道福祉専門学校","H134310000461","34(広島)"]
["専門学校ファッションビジネス・アカデミー福山","H134310000470","34(広島)"]
["穴吹調理製菓専門学校","H134310000489","34(広島)"]
["福山市医師会看護専門学校","H134310000498","34(広島)"]
["広島県東部美容専門学校","H134310000504","34(広島)"]
["専門学校福山歯科衛生士学校","H134310000522","34(広島)"]
["穴吹ビジネス専門学校","H134310000531","34(広島)"]
["穴吹国際みらい専門学校","H134310000540","34(広島)"]
["福山医療専門学校","H134310000559","34(広島)"]
["専門学校広島国際ビジネスカレッジ","H134310000586","34(広島)"]
["教文外語専門学校","H134310000595","34(広島)"]
["専門学校福山国際外語学院","H134310000602","34(広島)"]
["専門学校広島自動車大学校","H134310000611","34(広島)"]
["専門学校福祉リソースカレッジ広島","H134310000620","34(広島)"]
["広島製菓専門学校","H134310000639","34(広島)"]
["広島生活福祉専門学校","H134310000648","34(広島)"]
["広島福祉専門学校","H134310000657","34(広島)"]
["専門学校きくのファッションデザインカレッジ","H134310000666","34(広島)"]
["広島歯科技術専門学校","H134310000675","34(広島)"]
["吉田和裁専門学校","H134310000700","34(広島)"]
["日本ウェルネススポーツ専門学校広島校","H134310000719","34(広島)"]
["呉医療センター附属呉看護学校","H134310000728","34(広島)"]
["大原ビジネス公務員専門学校広島校","H134310000737","34(広島)"]
["広島情報ＩＴクリエイター専門学校　","H134310000746","34(広島)"]
["山口県立萩看護学校","H135210000015","35(山口)"]
["山口県立農業大学校","H135210000024","35(山口)"]
["周防大島町立大島看護専門学校","H135210000033","35(山口)"]
["立修館高等専修学校","H135310000013","35(山口)"]
["下関文化産業専門学校","H135310000022","35(山口)"]
["下関理容美容専門学校","H135310000040","35(山口)"]
["下関歯科技工専門学校","H135310000059","35(山口)"]
["下関福祉専門学校","H135310000068","35(山口)"]
["下関看護リハビリテーション学校","H135310000077","35(山口)"]
["さくら国際言語学院","H135310000086","35(山口)"]
["日本医療専門学校","H135310000095","35(山口)"]
["専門学校公務員ゼミナール下関校","H135310000102","35(山口)"]
["宇部看護専門学校","H135310000111","35(山口)"]
["ＹＩＣ情報ビジネス専門学校","H135310000120","35(山口)"]
["専門学校ＹＩＣリハビリテーション大学校","H135310000139","35(山口)"]
["山口コアカレッジ","H135310000148","35(山口)"]
["山口コ・メディカル学院","H135310000157","35(山口)"]
["山口県高等歯科衛生士学院","H135310000166","35(山口)"]
["ユーガーグルーミングスクール山口専修学校","H135310000175","35(山口)"]
["専門学校公務員ゼミナール山口校","H135310000184","35(山口)"]
["萩高等専修学校","H135310000193","35(山口)"]
["徳山看護専門学校","H135310000200","35(山口)"]
["徳山総合ビジネス専門学校","H135310000228","35(山口)"]
["ＹＩＣビューティモード専門学校","H135310000237","35(山口)"]
["防府文化家政専門学校","H135310000246","35(山口)"]
["防府看護専門学校","H135310000255","35(山口)"]
["ＹＩＣ看護福祉専門学校","H135310000264","35(山口)"]
["山口ビジネス学院","H135310000273","35(山口)"]
["下松デンタルアカデミー専門学校","H135310000282","35(山口)"]
["岩国ＹＭＣＡ国際医療福祉専門学校","H135310000291","35(山口)"]
["国立病院機構岩国医療センター附属岩国看護学校","H135310000308","35(山口)"]
["柳井音楽専門学校","H135310000317","35(山口)"]
["平生看護専門学校","H135310000326","35(山口)"]
["山口県理容美容専門学校","H135310000335","35(山口)"]
["北九州予備校山口校","H135310000344","35(山口)"]
["山口調理製菓専門学校","H135310000353","35(山口)"]
["ＹＩＣ公務員専門学校","H135310000362","35(山口)"]
["よしみず病院附属看護学院","H135310000371","35(山口)"]
["さくら国際言語教育学院","H135310000380","35(山口)"]
["ネムハイスクール高等専修学校","H135310000406","35(山口)"]
["東亜大学附属下関看護専門学校","H135310000415","35(山口)"]
["徳島県立総合看護学校","H136220100012","36(徳島)"]
["徳島県立農林水産総合技術支援センター農業大学校","H136234100013","36(徳島)"]
["龍昇経理情報専門学校","H136320100010","36(徳島)"]
["徳島歯科学院専門学校","H136320100029","36(徳島)"]
["和晃編物ファッションビジネス専門学校","H136320100038","36(徳島)"]
["専門学校健祥会学園","H136320100047","36(徳島)"]
["四国歯科衛生士学院専門学校","H136320100056","36(徳島)"]
["専門学校徳島穴吹カレッジ","H136320100065","36(徳島)"]
["平成調理師専門学校","H136320100074","36(徳島)"]
["徳島県美容学校","H136320100083","36(徳島)"]
["ブレーメン動物専門学校","H136320100092","36(徳島)"]
["徳島県鳴門病院附属看護専門学校","H136320200019","36(徳島)"]
["鴨島女子専門学校","H136320500016","36(徳島)"]
["徳島医療福祉専門学校","H136330100019","36(徳島)"]
["香川県立農業大学校","H137240300017","37(香川)"]
["シャルムドレスメーカー専門学校","H137320100019","37(香川)"]
["高松市医師会看護専門学校","H137320100028","37(香川)"]
["香川県歯科医療専門学校","H137320100037","37(香川)"]
["吉田愛服飾専門学校","H137320100046","37(香川)"]
["キッス調理技術専門学校","H137320100055","37(香川)"]
["専修学校香川県美容学校","H137320100064","37(香川)"]
["専門学校穴吹コンピュータカレッジ","H137320100073","37(香川)"]
["専門学校穴吹デザインカレッジ","H137320100082","37(香川)"]
["専門学校穴吹ビジネスカレッジ","H137320100091","37(香川)"]
["四国総合ビジネス専門学校","H137320100108","37(香川)"]
["四国医療福祉専門学校","H137320100117","37(香川)"]
["専門学校穴吹ビューティカレッジ","H137320100126","37(香川)"]
["専門学校穴吹リハビリテーションカレッジ","H137320100135","37(香川)"]
["専門学校穴吹工科カレッジ","H137320100144","37(香川)"]
["専門学校穴吹パティシエ福祉カレッジ","H137320100153","37(香川)"]
["高松高等予備校","H137320100162","37(香川)"]
["専門学校穴吹動物看護カレッジ","H137320100171","37(香川)"]
["穴吹医療大学校","H137320100180","37(香川)"]
["守里会看護福祉専門学校","H137320100199","37(香川)"]
["さぬき福祉専門学校","H137320200018","37(香川)"]
["香川看護専門学校","H137320400016","37(香川)"]
["独立行政法人国立病院機構四国こどもとおとなの医療センター附属善通寺看護学校","H137320400025","37(香川)"]
["四国学院大学専門学校","H137320800012","37(香川)"]
["四国医療専門学校","H137338600016","37(香川)"]
["愛媛県立農業大学校","H138220100010","38(愛媛)"]
["松山デザイナー専門学校","H138320100018","38(愛媛)"]
["愛媛調理製菓専門学校","H138320100027","38(愛媛)"]
["専門学校日産愛媛自動車大学校","H138320100036","38(愛媛)"]
["松山看護専門学校","H138320100045","38(愛媛)"]
["松山商科専修学校","H138320100054","38(愛媛)"]
["松山歯科衛生士専門学校","H138320100063","38(愛媛)"]
["専門学校松山ビジネスカレッジビジネス校","H138320100072","38(愛媛)"]
["河原電子ビジネス専門学校","H138320100081","38(愛媛)"]
["河原医療福祉専門学校","H138320100090","38(愛媛)"]
["大原簿記公務員専門学校愛媛校","H138320100107","38(愛媛)"]
["愛媛県美容専門学校","H138320100116","38(愛媛)"]
["河原デザイン・アート専門学校","H138320100125","38(愛媛)"]
["河原アイペットワールド専門学校","H138320100134","38(愛媛)"]
["愛媛コミュニケーションブライダル専門学校","H138320100143","38(愛媛)"]
["四国医療技術専門学校","H138320100152","38(愛媛)"]
["河原ビューティモード専門学校","H138320100161","38(愛媛)"]
["河原医療大学校","H138320100170","38(愛媛)"]
["河原外語観光・製菓専門学校","H138320100189","38(愛媛)"]
["河原調理専門学校","H138320100198","38(愛媛)"]
["今治看護専門学校","H138320200017","38(愛媛)"]
["今治商業専門学校","H138320200026","38(愛媛)"]
["宇和島文化女子専門学校","H138320300016","38(愛媛)"]
["宇和島商業専門学校","H138320300025","38(愛媛)"]
["宇和島看護専門学校","H138320300034","38(愛媛)"]
["東予理容美容専門学校","H138320500014","38(愛媛)"]
["新居浜和裁専門学校","H138320500023","38(愛媛)"]
["十全看護専門学校","H138320500032","38(愛媛)"]
["東城看護専門学校","H138320500041","38(愛媛)"]
["河原医療大学校新居浜校","H138320500050","38(愛媛)"]
["ドレスメーカー大洲専門学校","H138320700012","38(愛媛)"]
["三島高等洋裁専門学校","H138321300014","38(愛媛)"]
["四国中央医療福祉総合学院","H138321300023","38(愛媛)"]
["愛媛十全医療学院","H138321500012","38(愛媛)"]
["独立行政法人国立病院機構愛媛医療センター附属看護学校","H138321500021","38(愛媛)"]
["愛媛情報専門学校","H138340100016","38(愛媛)"]
["高知県立幡多看護専門学校","H139210000011","39(高知)"]
["高知県立農業大学校","H139210000020","39(高知)"]
["ＲＫＣ調理製菓専門学校","H139310000019","39(高知)"]
["ヒューマンビジネス専修学校","H139310000028","39(高知)"]
["土佐情報経理専門学校","H139310000037","39(高知)"]
["高知文化服装専門学校","H139310000046","39(高知)"]
["高知理容美容専門学校","H139310000055","39(高知)"]
["高知医療学院","H139310000064","39(高知)"]
["洋影編物専門学校","H139310000073","39(高知)"]
["高知リハビリテーション学院","H139310000082","39(高知)"]
["龍馬情報ビジネス＆フード専門学校","H139310000091","39(高知)"]
["高知福祉専門学校","H139310000108","39(高知)"]
["龍馬デザイン・ビューティ専門学校","H139310000117","39(高知)"]
["平成福祉専門学校","H139310000126","39(高知)"]
["龍馬看護ふくし専門学校","H139310000135","39(高知)"]
["四国医療工学専門学校","H139310000144","39(高知)"]
["土佐リハビリテーションカレッジ","H139310000153","39(高知)"]
["近森病院附属看護学校","H139310000162","39(高知)"]
["中村女子専門学校","H139310000171","39(高知)"]
["四万十看護学院","H139310000180","39(高知)"]
["土佐清水高等専修学校","H139310000199","39(高知)"]
["高知語学＆ビジネス専門学校","H139310000206","39(高知)"]
["高知開成専門学校","H139310000215","39(高知)"]
["高知ペットビジネス専門学校","H139310000233","39(高知)"]
["国立病院機構高知病院附属看護学校","H139310000242","39(高知)"]
["専修学校香南学園","H139310000251","39(高知)"]
["国立障害者リハビリテーションセンター自立支援局福岡視力障害センター","H140110000010","40(福岡)"]
["北九州市立戸畑高等専修学校","H140210000018","40(福岡)"]
["浅井和裁専門学校","H140310000025","40(福岡)"]
["北九州市戸畑看護専門学校","H140310000034","40(福岡)"]
["北九州市立看護専門学校","H140310000052","40(福岡)"]
["健和看護学院","H140310000061","40(福岡)"]
["美萩野臨床医学専門学校","H140310000070","40(福岡)"]
["美萩野保健衛生学院","H140310000089","40(福岡)"]
["専門学校九州テクノカレッジ","H140310000098","40(福岡)"]
["九州ビジネス専門学校","H140310000105","40(福岡)"]
["北九州小倉看護専門学校","H140310000114","40(福岡)"]
["和裁専門学校若葉学園","H140310000123","40(福岡)"]
["北九州調理製菓専門学校","H140310000132","40(福岡)"]
["ＫＣＳ北九州情報専門学校","H140310000141","40(福岡)"]
["専修学校河合塾北九州校","H140310000150","40(福岡)"]
["麻生公務員専門学校北九州校","H140310000169","40(福岡)"]
["麻生情報ビジネス専門学校北九州校","H140310000178","40(福岡)"]
["北九州予備校小倉駅校","H140310000196","40(福岡)"]
["福岡美容専門学校北九州校","H140310000203","40(福岡)"]
["大原情報ＩＴ簿記公務員専門学校小倉校","H140310000212","40(福岡)"]
["九州医療スポーツ専門学校","H140310000221","40(福岡)"]
["大原医療福祉製菓専門学校小倉校","H140310000230","40(福岡)"]
["専門学校北九州自動車大学校","H140310000249","40(福岡)"]
["小倉南看護専門学校","H140310000258","40(福岡)"]
["西日本看護専門学校","H140310000267","40(福岡)"]
["小倉リハビリテーション学院","H140310000276","40(福岡)"]
["専門学校北九州看護大学校","H140310000285","40(福岡)"]
["製鉄記念八幡看護専門学校","H140310000294","40(福岡)"]
["八幡医師会看護専門学院","H140310000301","40(福岡)"]
["専門学校大原自動車工科大学校","H140310000310","40(福岡)"]
["日本ウェルネススポーツ専門学校北九州校","H140310000329","40(福岡)"]
["北九州予備校黒崎校","H140310000338","40(福岡)"]
["九州ＣＴＢ理容美容専門学校","H140310000347","40(福岡)"]
["福岡建設専門学校","H140313000010","40(福岡)"]
["原看護専門学校","H140313000029","40(福岡)"]
["福岡外語専門学校","H140313000038","40(福岡)"]
["福岡看護専門学校","H140313000047","40(福岡)"]
["福岡和白リハビリテーション学院","H140313000056","40(福岡)"]
["博多メディカル専門学校","H140313000065","40(福岡)"]
["福岡国土建設専門学校","H140313000074","40(福岡)"]
["九州電気専門学校","H140313000083","40(福岡)"]
["専門学校日本デザイナー学院","H140313000092","40(福岡)"]
["専門学校九州デザイナー学院","H140313000109","40(福岡)"]
["専門学校九州スクール・オブ・ビジネス","H140313000118","40(福岡)"]
["九州観光専門学校","H140313000127","40(福岡)"]
["麻生情報ビジネス専門学校","H140313000145","40(福岡)"]
["公務員ビジネス専門学校","H140313000154","40(福岡)"]
["福岡医療秘書福祉専門学校","H140313000163","40(福岡)"]
["専門学校第一自動車大学校","H140313000172","40(福岡)"]
["大原簿記ビジネス専門学校福岡校","H140313000181","40(福岡)"]
["麻生外語観光＆製菓専門学校","H140313000190","40(福岡)"]
["専修学校代々木ゼミナール福岡校","H140313000207","40(福岡)"]
["福岡リゾートアンドスポーツ専門学校","H140313000216","40(福岡)"]
["福岡デザイン＆テクノロジー専門学校","H140313000225","40(福岡)"]
["医療ビジネス専門学校","H140313000234","40(福岡)"]
["麻生医療福祉専門学校福岡校","H140313000243","40(福岡)"]
["専門学校九州ビジュアルアーツ","H140313000252","40(福岡)"]
["麻生建築＆デザイン専門学校","H140313000261","40(福岡)"]
["福岡スクールオブミュージック＆ダンス専門学校","H140313000270","40(福岡)"]
["北九州予備校博多駅校","H140313000289","40(福岡)"]
["福岡ビューティーアート専門学校","H140313000298","40(福岡)"]
["専門学校麻生リハビリテーション大学校","H140313000305","40(福岡)"]
["大原スポーツ公務員専門学校福岡校","H140313000314","40(福岡)"]
["福岡医健・スポーツ専門学校","H140313000323","40(福岡)"]
["福岡リハビリテーション専門学校","H140313000332","40(福岡)"]
["専門学校福岡ビジョナリーアーツ","H140313000341","40(福岡)"]
["福岡ＥＣＯ動物海洋専門学校","H140313000350","40(福岡)"]
["福岡ベルエポック美容専門学校","H140313000369","40(福岡)"]
["麻生公務員専門学校福岡校","H140313000378","40(福岡)"]
["大原保育医療福祉専門学校福岡校","H140313000387","40(福岡)"]
["専門学校麻生工科自動車大学校","H140313000396","40(福岡)"]
["専門学校公務員ゼミナール","H140313000403","40(福岡)"]
["福岡キャリナリー農業・食テクノロジー専門学校","H140313000412","40(福岡)"]
["国際アニメーション専門学校","H140313000421","40(福岡)"]
["福岡こども専門学校","H140313000430","40(福岡)"]
["福岡ウェディングアンドブライダル専門学校","H140313000449","40(福岡)"]
["福岡ウェディング＆ホテル・ＩＲ専門学校","H140313000458","40(福岡)"]
["福岡スクールオブミュージック高等専修学校","H140313000467","40(福岡)"]
["ＡＳＯポップカルチャー専門学校","H140313000476","40(福岡)"]
["ＫＣＳ福岡情報専門学校","H140313000485","40(福岡)"]
["専門学校福岡カレッジ・オブ・ビジネス","H140313000494","40(福岡)"]
["香蘭ファッションデザイン専門学校","H140313000500","40(福岡)"]
["九州英数学舘","H140313000519","40(福岡)"]
["福岡調理師専門学校","H140313000528","40(福岡)"]
["専門学校ライセンスカレッジ","H140313000537","40(福岡)"]
["福岡歯科衛生専門学校","H140313000546","40(福岡)"]
["中村調理製菓専門学校","H140313000555","40(福岡)"]
["専門学校コンピュータ教育学院","H140313000564","40(福岡)"]
["九州外語専門学校","H140313000573","40(福岡)"]
["Ｆ・Ｃフチガミ医療福祉専門学校","H140313000582","40(福岡)"]
["中村国際ホテル専門学校","H140313000591","40(福岡)"]
["大村美容ファッション専門学校","H140313000608","40(福岡)"]
["専門学校西鉄国際ビジネスカレッジ","H140313000617","40(福岡)"]
["専修学校河合塾福岡校","H140313000626","40(福岡)"]
["ＩＬＰお茶の水医療福祉専門学校","H140313000635","40(福岡)"]
["福岡デザイン専門学校","H140313000644","40(福岡)"]
["福岡有朋高等専修学校","H140313000653","40(福岡)"]
["麻生美容専門学校","H140313000662","40(福岡)"]
["福岡美容専門学校福岡校","H140313000671","40(福岡)"]
["福岡天神医療リハビリ専門学校","H140313000680","40(福岡)"]
["専門学校東京国際ビジネスカレッジ福岡校","H140313000699","40(福岡)"]
["駿台予備学校福岡校","H140313000706","40(福岡)"]
["福岡理容美容専門学校","H140313000715","40(福岡)"]
["専門学校ＥＳＰエンタテインメント福岡","H140313000724","40(福岡)"]
["福岡県私設病院協会看護学校","H140313000733","40(福岡)"]
["西日本アカデミー航空専門学校","H140313000742","40(福岡)"]
["専門学校コンピュータ教育学院メディアコミュニケーション","H140313000751","40(福岡)"]
["国際エステティック専門学校","H140313000760","40(福岡)"]
["専門学校国際貢献専門大学校","H140313000779","40(福岡)"]
["福岡介護福祉専門学校","H140313000788","40(福岡)"]
["福岡市医師会看護専門学校","H140313000797","40(福岡)"]
["福岡医療専門学校","H140313000804","40(福岡)"]
["愛和システムエンジニア専門学校","H140313000822","40(福岡)"]
["高等専修学校Ｃ＆Ｓ学院","H140313000831","40(福岡)"]
["専門学校愛心国際ビジネスカレッジ","H140313000840","40(福岡)"]
["東アジア情報専門学校","H140313000859","40(福岡)"]
["福岡情報ＩＴクリエイター専門学校","H140313000868","40(福岡)"]
["グローバルクリエイター専門学校","H140313000877","40(福岡)"]
["大牟田医師会看護専門学校","H140320200013","40(福岡)"]
["専修学校紫苑学院","H140320200022","40(福岡)"]
["久留米大学医学部附属臨床検査専門学校","H140320300012","40(福岡)"]
["久留米医師会看護専門学校","H140320300021","40(福岡)"]
["専門学校久留米ドレスメーカー女学院","H140320300030","40(福岡)"]
["久留米電子ビジネス専門学校","H140320300049","40(福岡)"]
["久留米歯科衛生専門学校","H140320300058","40(福岡)"]
["福岡南美容専門学校","H140320300067","40(福岡)"]
["専修学校久留米ゼミナール","H140320300076","40(福岡)"]
["専門学校共生館国際福祉医療カレッジ","H140320300085","40(福岡)"]
["古賀国際看護学院","H140320300094","40(福岡)"]
["筑豊看護専門学校","H140320400011","40(福岡)"]
["直方看護専修学校","H140320400020","40(福岡)"]
["飯塚文化専門学校","H140320500010","40(福岡)"]
["飯塚理容美容専門学校","H140320500029","40(福岡)"]
["飯塚医師会看護高等専修学校","H140320500038","40(福岡)"]
["九州歯科技工専門学校","H140320500047","40(福岡)"]
["専門学校麻生看護大学校","H140320500056","40(福岡)"]
["田川看護高等専修学校","H140320600019","40(福岡)"]
["柳川山門医師会看護高等専修学校","H140320700018","40(福岡)"]
["専門学校柳川リハビリテーション学院","H140320700027","40(福岡)"]
["ハリウッドワールド美容専門学校","H140320700036","40(福岡)"]
["八女筑後看護専門学校","H140321000013","40(福岡)"]
["樋口文化専門学校","H140321000022","40(福岡)"]
["大川看護福祉専門学校","H140321200011","40(福岡)"]
["京都医師会看護高等専修学校","H140321300010","40(福岡)"]
["豊前築上医師会看護高等専修学校","H140321400019","40(福岡)"]
["平岡調理・製菓専門学校","H140321600017","40(福岡)"]
["平岡栄養士専門学校","H140321600026","40(福岡)"]
["高尾看護専門学校","H140321600035","40(福岡)"]
["平岡介護福祉専門学校","H140321600044","40(福岡)"]
["西鉄自動車整備専門学校","H140321900014","40(福岡)"]
["筑紫看護高等専修学校","H140322100010","40(福岡)"]
["福間看護高等専修学校","H140322400017","40(福岡)"]
["宗像看護専門学校","H140322400026","40(福岡)"]
["あさくら看護学校","H140322800013","40(福岡)"]
["遠賀中間医師会立遠賀中央看護助産学校","H140338200015","40(福岡)"]
["福岡水巻看護助産学校","H140338200024","40(福岡)"]
["専門学校久留米自動車工科大学校","H140354400010","40(福岡)"]
["専門学校久留米リハビリテーション学院","H140354400029","40(福岡)"]
["北九州保育福祉専門学校","H140362100016","40(福岡)"]
["北九州リハビリテーション学院","H140362100025","40(福岡)"]
["おばせ看護学院","H140362100034","40(福岡)"]
["佐賀県農業大学校","H141290000019","41(佐賀)"]
["寺元ドレメデザイン専門学校","H141320100013","41(佐賀)"]
["佐賀市医師会立看護専門学校","H141320100022","41(佐賀)"]
["佐賀工業専門学校","H141320100031","41(佐賀)"]
["西九州調理師学校","H141320100040","41(佐賀)"]
["白百合和裁専門学校","H141320100059","41(佐賀)"]
["佐賀コンピュータ専門学校","H141320100068","41(佐賀)"]
["九州国際情報ビジネス専門学校","H141320100077","41(佐賀)"]
["佐賀歯科衛生専門学校","H141320100086","41(佐賀)"]
["久留米ゼミナール佐賀校","H141320100095","41(佐賀)"]
["西九州大学佐賀調理製菓専門学校","H141320100102","41(佐賀)"]
["専門学校公務員ゼミナール","H141320100111","41(佐賀)"]
["九州国際高等学園","H141320100120","41(佐賀)"]
["アイ・ビービューティカレッジ","H141320100139","41(佐賀)"]
["佐賀星生学園","H141320100148","41(佐賀)"]
["エッジ国際美容専門学校","H141320100157","41(佐賀)"]
["専門学校モードリゲル","H141320200012","41(佐賀)"]
["唐津看護専門学校","H141320200021","41(佐賀)"]
["唐津ビジネスカレッジ","H141320200030","41(佐賀)"]
["九州医療専門学校","H141320300011","41(佐賀)"]
["鳥栖三養基医師会立看護高等専修学校","H141320300020","41(佐賀)"]
["医療福祉専門学校緑生館","H141320300039","41(佐賀)"]
["アカデミー看護専門学校","H141320300048","41(佐賀)"]
["ＣＯＤＯ外語観光専門学校","H141320300057","41(佐賀)"]
["伊万里看護学校","H141320500019","41(佐賀)"]
["武雄看護学校","H141320600018","41(佐賀)"]
["武雄看護リハビリテーション学校","H141320600027","41(佐賀)"]
["鹿島藤津地区医師会立看護高等専修学校","H141320700017","41(佐賀)"]
["独立行政法人国立病院機構嬉野医療センター附属看護学校","H141320900015","41(佐賀)"]
["佐賀県医療センター好生館看護学院","H141390000017","41(佐賀)"]
["佐世保市立看護専門学校","H142210000016","42(長崎)"]
["和田文化服装専門学校","H142310000014","42(長崎)"]
["ミユキ学園諫早服装専門学校","H142310000032","42(長崎)"]
["玉英和裁専門学校","H142310000041","42(長崎)"]
["ソシアル淳心ファションビジネス専門学校","H142310000050","42(長崎)"]
["森家政専門学校","H142310000069","42(長崎)"]
["九州文化学園調理師専門学校","H142310000078","42(長崎)"]
["長崎市医師会看護専門学校","H142310000087","42(長崎)"]
["九州医学技術専門学校","H142310000096","42(長崎)"]
["佐世保市医師会看護専門学校","H142310000103","42(長崎)"]
["島原市医師会看護学校","H142310000112","42(長崎)"]
["九州文化学園歯科衛生士学院","H142310000121","42(長崎)"]
["長崎リハビリテーション学院","H142310000130","42(長崎)"]
["長崎情報処理専門学校","H142310000149","42(長崎)"]
["長崎歯科衛生士専門学校","H142310000158","42(長崎)"]
["国際情報科学専門学校","H142310000167","42(長崎)"]
["専門学校長崎就職支援カレッジ","H142310000176","42(長崎)"]
["長崎医療こども専門学校","H142310000185","42(長崎)"]
["専門学校させぼ公務員オブビジネス","H142310000194","42(長崎)"]
["長崎ＮＩＣコンピュータ学院専門学校","H142310000201","42(長崎)"]
["九州調理師専門学校","H142310000210","42(長崎)"]
["長崎医療技術専門学校","H142310000229","42(長崎)"]
["長崎公務員専門学校","H142310000238","42(長崎)"]
["長崎県央看護学校","H142310000247","42(長崎)"]
["北九州予備校長崎校","H142310000256","42(長崎)"]
["長崎県美容専門学校","H142310000265","42(長崎)"]
["エコール・ド・パティスリー長崎","H142310000283","42(長崎)"]
["こころ医療福祉専門学校","H142310000292","42(長崎)"]
["九州ＳＯＧＩ専門学校","H142310000309","42(長崎)"]
["メトロＩＴビジネスカレッジ","H142310000318","42(長崎)"]
["佐世保美容専門学校","H142310000327","42(長崎)"]
["こころ医療福祉専門学校佐世保校","H142310000336","42(長崎)"]
["専門学校公務員ゼミナール佐世保校","H142310000345","42(長崎)"]
["こころ医療福祉専門学校壱岐校","H142310000354","42(長崎)"]
["上天草看護専門学校","H143210000015","43(熊本)"]
["熊本市立総合ビジネス専門学校","H143210000024","43(熊本)"]
["天草市立本渡看護専門学校","H143210000033","43(熊本)"]
["熊本県立農業大学校","H143210000042","43(熊本)"]
["専修学校熊本壺溪塾","H143310000013","43(熊本)"]
["西日本教育医療専門学校","H143310000022","43(熊本)"]
["九州工科自動車専門学校","H143310000031","43(熊本)"]
["ヒロ・デザイン専門学校","H143310000040","43(熊本)"]
["シェフパティシエ学院","H143310000059","43(熊本)"]
["九州測量専門学校","H143310000068","43(熊本)"]
["専修学校熊本ＹＭＣＡ学院","H143310000077","43(熊本)"]
["熊本看護専門学校","H143310000086","43(熊本)"]
["熊本歯科技術専門学校","H143310000095","43(熊本)"]
["熊本市医師会看護専門学校","H143310000102","43(熊本)"]
["八代実業専門学校","H143310000111","43(熊本)"]
["熊本労災看護専門学校","H143310000120","43(熊本)"]
["九州技術教育専門学校","H143310000139","43(熊本)"]
["専修学校九州高等商業学校","H143310000148","43(熊本)"]
["天草郡市医師会附属天草准看護高等専修学校","H143310000157","43(熊本)"]
["鹿本医師会看護学校","H143310000166","43(熊本)"]
["三角商業専門学校","H143310000175","43(熊本)"]
["宇城看護高等専修学校","H143310000184","43(熊本)"]
["菊池郡市医師会立看護高等専修学校","H143310000193","43(熊本)"]
["専門学校湖東カレッジ","H143310000200","43(熊本)"]
["熊本歯科衛生士専門学院","H143310000219","43(熊本)"]
["八代看護学校","H143310000228","43(熊本)"]
["和洋学園専門学校","H143310000237","43(熊本)"]
["熊本総合医療リハビリテーション学院","H143310000246","43(熊本)"]
["熊本工業専門学校","H143310000255","43(熊本)"]
["九州美容専門学校","H143310000264","43(熊本)"]
["熊本電子ビジネス専門学校","H143310000273","43(熊本)"]
["熊本ベルェベル美容専門学校","H143310000282","43(熊本)"]
["熊本外語専門学校","H143310000291","43(熊本)"]
["専門学校湖東カレッジ唐人町校","H143310000308","43(熊本)"]
["専門学校国際文化教養大学校","H143310000317","43(熊本)"]
["熊本デザイン専門学校","H143310000326","43(熊本)"]
["熊本高等理容学校","H143310000335","43(熊本)"]
["メディカル・カレッジ青照館","H143310000344","43(熊本)"]
["独立行政法人国立病院機構熊本医療センター附属看護学校","H143310000353","43(熊本)"]
["専門学校公務員ゼミナール熊本校","H143310000362","43(熊本)"]
["北九州予備校熊本校","H143310000371","43(熊本)"]
["九州技術教育専門学校熊本校","H143310000380","43(熊本)"]
["専修学校モア・ヘアメイクカレッジ","H143310000399","43(熊本)"]
["九州中央リハビリテーション学院","H143310000406","43(熊本)"]
["日本総合教育専門学校","H143310000415","43(熊本)"]
["熊本駅前看護リハビリテーション学院","H143310000424","43(熊本)"]
["専門学校東京ＣＰＡ会計学院熊本校","H143310000433","43(熊本)"]
["大原簿記情報専門学校熊本校","H143310000442","43(熊本)"]
["大原スポーツ公務員専門学校熊本校","H143310000451","43(熊本)"]
["大原保育医療福祉専門学校熊本校","H143310000460","43(熊本)"]
["九州動物学院","H143310000479","43(熊本)"]
["イデアＩＴカレッジ阿蘇","H143310000488","43(熊本)"]
["大分県立農業大学校","H144210000014","44(大分)"]
["朝来野学園女子専門学校","H144310000012","44(大分)"]
["大分市医師会看護専門学校","H144310000021","44(大分)"]
["大分県歯科技術専門学校","H144310000030","44(大分)"]
["別府市医師会立別府青山看護学校","H144310000049","44(大分)"]
["ハリマドレスメーカー専門学校","H144310000058","44(大分)"]
["田北料理学院","H144310000067","44(大分)"]
["生野家政専門学校","H144310000076","44(大分)"]
["大分臨床検査技師専門学校","H144310000085","44(大分)"]
["大分歯科専門学校","H144310000094","44(大分)"]
["オーキドレスメーカー専門学校","H144310000110","44(大分)"]
["日田香蘭高等専修学校","H144310000129","44(大分)"]
["日田市医師会立日田准看護学院","H144310000138","44(大分)"]
["専修学校府内学園","H144310000147","44(大分)"]
["中津育英学館","H144310000156","44(大分)"]
["田北調理師専門学校","H144310000165","44(大分)"]
["専門学校明日香美容文化専門大学校","H144310000174","44(大分)"]
["大分市医師会立大分准看護専門学院","H144310000183","44(大分)"]
["田北ビジネス専門学校","H144310000192","44(大分)"]
["専修学校大分経理専門学校","H144310000209","44(大分)"]
["ＫＣＳ大分情報専門学校","H144310000218","44(大分)"]
["ＩＶＹ大分高度コンピュータ専門学校","H144310000227","44(大分)"]
["大分臨床工学技士専門学校","H144310000236","44(大分)"]
["大分視能訓練士専門学校","H144310000245","44(大分)"]
["藤華医療技術専門学校","H144310000254","44(大分)"]
["大分リハビリテーション専門学校","H144310000263","44(大分)"]
["専修学校明星国際ビューティカレッジ","H144310000272","44(大分)"]
["中津ファビオラ看護学校","H144310000281","44(大分)"]
["大分介護福祉士専門学校","H144310000290","44(大分)"]
["智泉福祉製菓専門学校","H144310000307","44(大分)"]
["藤華医療事務専門学校","H144310000316","44(大分)"]
["北九州予備校大分校","H144310000325","44(大分)"]
["大分医学技術専門学校","H144310000334","44(大分)"]
["日本文理大学医療専門学校","H144310000343","44(大分)"]
["別府医療センター附属大分中央看護学校","H144310000352","44(大分)"]
["専門学校九州総合スポーツカレッジ","H144310000361","44(大分)"]
["国際調理師専修学校","H144310000370","44(大分)"]
["アンビシャス国際美容学校","H144310000389","44(大分)"]
["大分ドッググルーミング専門学校","H144310000398","44(大分)"]
["明日香国際ブライダル＆ホテル観光専門学校","H144310000405","44(大分)"]
["大原簿記公務員専門学校大分校","H144310000414","44(大分)"]
["大原医療介護福祉専門学校大分校","H144310000423","44(大分)"]
["智泉幼児保育専門学校","H144310000432","44(大分)"]
["ＩＶＹ大分医療総合専門学校","H144310000441","44(大分)"]
["大原自動車工科専門学校大分校","H144310000450","44(大分)"]
["藤華歯科衛生専門学校","H144310000469","44(大分)"]
["オペレーションズマネジメントシステムスクール","H144310000478","44(大分)"]
["明星ワールドビジネス観光専門学校","H144310000487","44(大分)"]
["県立農業大学校","H145240187006","45(宮崎)"]
["マナビヤ宮崎アカデミー","H145320186114","45(宮崎)"]
["向洋学園高等専修学校","H145320186123","45(宮崎)"]
["宮崎マルチメディア専門学校","H145320186132","45(宮崎)"]
["宮崎ビジネス公務員専門学校","H145320186203","45(宮崎)"]
["宮崎看護専門学校","H145320186212","45(宮崎)"]
["宮崎歯科技術専門学校","H145320186230","45(宮崎)"]
["宮崎ユニバーサル・カレッジ","H145320186258","45(宮崎)"]
["宮崎リハビリテーション学院","H145320186267","45(宮崎)"]
["宮崎医療管理専門学校","H145320186285","45(宮崎)"]
["宮崎情報ビジネス医療専門学校","H145320186347","45(宮崎)"]
["宮崎美容専門学校","H145320186356","45(宮崎)"]
["大原簿記公務員専門学校","H145320186436","45(宮崎)"]
["宮崎保健福祉専門学校","H145320186472","45(宮崎)"]
["宮崎ペットワールド専門学校","H145320186481","45(宮崎)"]
["宮崎サザンビューティ専門学校","H145320186506","45(宮崎)"]
["九州保健福祉大学総合医療専門学校","H145320186515","45(宮崎)"]
["南九州医療・技術＆スポーツ専門学校","H145320186542","45(宮崎)"]
["宮崎ブライダル＆医療専門学校","H145320186551","45(宮崎)"]
["北九州予備校宮崎校","H145320186560","45(宮崎)"]
["フィオーレＫＯＧＡ看護専門学校","H145320186597","45(宮崎)"]
["都城調理師高等専修学校","H145320286195","45(宮崎)"]
["都城看護専門学校","H145320286220","45(宮崎)"]
["都城コアカレッジ","H145320286364","45(宮崎)"]
["独立行政法人国立病院機構都城医療センター附属看護学校","H145320286499","45(宮崎)"]
["都城デンタルコアカレッジ","H145320286532","45(宮崎)"]
["豊心福祉学園","H145320286587","45(宮崎)"]
["都城リハビリテーション学院","H145320286603","45(宮崎)"]
["トライアート・カレッジ","H145320386158","45(宮崎)"]
["延岡看護専門学校","H145320386443","45(宮崎)"]
["日南看護専門学校","H145320486335","45(宮崎)"]
["宮崎福祉医療カレッジ","H145320486460","45(宮崎)"]
["小林看護医療専門学校","H145320586575","45(宮崎)"]
["日向看護高等専修学校","H145320686422","45(宮崎)"]
["宮崎医療福祉専門学校","H145320886279","45(宮崎)"]
["藤元メディカルシステム付属医療専門学校","H145334186375","45(宮崎)"]
["鹿屋市立鹿屋看護専門学校","H146210000012","46(鹿児島)"]
["鹿児島県立農業大学校","H146210000021","46(鹿児島)"]
["鹿児島中央専門学校","H146310000010","46(鹿児島)"]
["赤塚学園美容・デザイン専門学校","H146310000029","46(鹿児島)"]
["鹿児島看護専門学校","H146310000038","46(鹿児島)"]
["たちばな医療専門学校","H146310000047","46(鹿児島)"]
["仁心看護専門学校","H146310000056","46(鹿児島)"]
["今村学園ライセンスアカデミー","H146310000065","46(鹿児島)"]
["鹿児島県理容美容専門学校","H146310000074","46(鹿児島)"]
["野村服飾専門学校","H146310000083","46(鹿児島)"]
["鹿児島中央看護専門学校","H146310000092","46(鹿児島)"]
["鹿児島工学院専門学校","H146310000109","46(鹿児島)"]
["第一東大医進予備校","H146310000118","46(鹿児島)"]
["鹿児島歯科学院専門学校","H146310000127","46(鹿児島)"]
["鹿児島英語専修学校","H146310000136","46(鹿児島)"]
["川内看護専門学校","H146310000145","46(鹿児島)"]
["鹿児島県医療法人協会立看護専門学校","H146310000154","46(鹿児島)"]
["鹿児島鍼灸専門学校","H146310000163","46(鹿児島)"]
["ＫＣＳ鹿児島情報専門学校","H146310000172","46(鹿児島)"]
["鹿児島情報ビジネス公務員専門学校","H146310000181","46(鹿児島)"]
["鹿児島キャリアデザイン専門学校","H146310000190","46(鹿児島)"]
["鹿児島医療福祉専門学校","H146310000207","46(鹿児島)"]
["出水郡医師会広域医療センター附属阿久根看護学校","H146310000216","46(鹿児島)"]
["南九州医療事務医療秘書専門学校","H146310000225","46(鹿児島)"]
["久木田学園看護専門学校","H146310000234","46(鹿児島)"]
["鹿児島医療技術専門学校","H146310000243","46(鹿児島)"]
["加治木看護専門学校","H146310000252","46(鹿児島)"]
["鹿児島公務員専修学校","H146310000261","46(鹿児島)"]
["鹿児島外語学院","H146310000270","46(鹿児島)"]
["神村学園専修学校","H146310000289","46(鹿児島)"]
["鹿児島高等予備校","H146310000298","46(鹿児島)"]
["奄美看護福祉専門学校","H146310000305","46(鹿児島)"]
["鹿児島レディスカレッジ","H146310000314","46(鹿児島)"]
["鹿児島県美容専門学校","H146310000323","46(鹿児島)"]
["鹿児島第一医療リハビリ専門学校","H146310000332","46(鹿児島)"]
["独立行政法人国立病院機構鹿児島医療センター附属鹿児島看護学校","H146310000350","46(鹿児島)"]
["北九州予備校鹿児島校","H146310000369","46(鹿児島)"]
["奄美情報処理専門学校","H146310000378","46(鹿児島)"]
["赤塚学園看護専門学校","H146310000387","46(鹿児島)"]
["鹿児島環境・情報専門学校","H146310000396","46(鹿児島)"]
["鹿児島医療工学専門学校","H146310000403","46(鹿児島)"]
["学校法人新島学園　沖縄調理師専門学校","H147320100017","47(沖縄)"]
["大育情報ビジネス専門学校","H147320100026","47(沖縄)"]
["沖縄ビジネス外語学院","H147320100035","47(沖縄)"]
["専修学校　国際電子ビジネス専門学校","H147320100044","47(沖縄)"]
["ＣＳＣコンピューター学院","H147320100053","47(沖縄)"]
["沖縄福祉保育専門学校","H147320100062","47(沖縄)"]
["琉美インターナショナルビューティーカレッジ","H147320100071","47(沖縄)"]
["大育高等専修学校","H147320100080","47(沖縄)"]
["那覇情報システム専門学校","H147320100099","47(沖縄)"]
["専門学校那覇日経ビジネス","H147320100106","47(沖縄)"]
["専修学校沖縄大原簿記公務員専門学校","H147320100115","47(沖縄)"]
["専門学校大育","H147320100124","47(沖縄)"]
["専修学校インターナショナルリゾートカレッジ","H147320100133","47(沖縄)"]
["専修学校沖縄ペットワールド専門学校","H147320100142","47(沖縄)"]
["専修学校ビューティーモードカレッジ","H147320100151","47(沖縄)"]
["育英義塾教員養成学院","H147320100160","47(沖縄)"]
["沖縄情報経理専門学校那覇校","H147320100179","47(沖縄)"]
["学校法人南西学園サイ・テク・カレッジ那覇","H147320100188","47(沖縄)"]
["専門学校ＩＴカレッジ沖縄","H147320100197","47(沖縄)"]
["尚学院　国際ビジネスアカデミー","H147320100204","47(沖縄)"]
["大育理容美容専門学校","H147320100213","47(沖縄)"]
["専修学校エルケア医療保育専門学校","H147320100222","47(沖縄)"]
["専門学校ライフジュニアカレッジ","H147320100231","47(沖縄)"]
["北九州予備校　沖縄校","H147320100240","47(沖縄)"]
["スペースチャイナ外語学院","H147320100259","47(沖縄)"]
["沖縄こども専門学校","H147320100268","47(沖縄)"]
["沖縄ブライダルアンドホテル観光専門学校","H147320100277","47(沖縄)"]
["沖縄ラフ＆ピース専門学校","H147320100286","47(沖縄)"]
["沖縄ビューティーアート専門学校","H147320100295","47(沖縄)"]
["沖縄リゾートアンドスポーツ専門学校","H147320100302","47(沖縄)"]
["尚学院公務員法律専門学校","H147320100320","47(沖縄)"]
["専修学校那覇尚学院","H147320100339","47(沖縄)"]
["大智国際ビジネス専門学校","H147320100348","47(沖縄)"]
["パシフィックテクノカレッジ学院","H147320500013","47(沖縄)"]
["専修学校育成保育カレッジ学院","H147320500022","47(沖縄)"]
["沖縄ホテル観光専門学校","H147320500031","47(沖縄)"]
["沖縄医療工学院","H147320500040","47(沖縄)"]
["琉球調理師専修学校","H147320800010","47(沖縄)"]
["沖縄歯科衛生士学校","H147320800029","47(沖縄)"]
["専修学校インターナショナルデザインアカデミー","H147320800038","47(沖縄)"]
["ＪＳＬインターナショナルカレッジ","H147320800047","47(沖縄)"]
["学校法人湘央学園浦添看護学校","H147320800056","47(沖縄)"]
["専門学校沖縄統合医療学院","H147320800065","47(沖縄)"]
["北部地区医師会北部看護学校","H147320900019","47(沖縄)"]
["沖縄情報経理専門学校名護校","H147320900028","47(沖縄)"]
["沖縄情報経理専門学校","H147321100015","47(沖縄)"]
["ＣＳＣコンピューター学院中部校","H147321100024","47(沖縄)"]
["中部美容専門学校","H147321100042","47(沖縄)"]
["専門学校日経ビジネス","H147321100051","47(沖縄)"]
["那覇市医師会那覇看護専門学校","H147321200014","47(沖縄)"]
["沖縄アカデミー専門学校","H147321200023","47(沖縄)"]
["海邦電子ビジネス専門学校","H147321300013","47(沖縄)"]
["中部地区医師会立ぐしかわ看護専門学校","H147321300022","47(沖縄)"]
["沖縄国際学院高等専修学校","H147321500011","47(沖縄)"]
["高等専修学校珊瑚舎スコーレ高等部","H147321500020","47(沖縄)"]
["専門学校琉球リハビリテーション学院","H147331400011","47(沖縄)"]
["専門学校沖縄中央学園","H147332600017","47(沖縄)"]
["専門学校沖縄ブライダルモード学園","H147332600026","47(沖縄)"]
["学校法人南西学園サイ・テク・カレッジ美浜","H147332600035","47(沖縄)"]
["ソーシャルワーク専門学校","H147332700016","47(沖縄)"]
["医療法人おもと会沖縄リハビリテーション福祉学院","H147334800011","47(沖縄)"]
["学校法人おもと会沖縄看護専門学校","H147334800020","47(沖縄)"]

{"sheet":"Sheet2","index":14,"n_rows":49,"n_cols":5,"rows_kept":49,"cut":false,"hidden":true,"merged":[]}
[]
[null,"番号","都道府県名",null,"都道府県"]
[null,"01","北海道",null,"01北海道"]
[null,"02","青   森",null,"02青   森"]
[null,"03","岩   手",null,"03岩   手"]
[null,"04","宮   城",null,"04宮   城"]
[null,"05","秋   田",null,"05秋   田"]
[null,"06","山   形",null,"06山   形"]
[null,"07","福   島",null,"07福   島"]
[null,"08","茨   城",null,"08茨   城"]
[null,"09","栃   木",null,"09栃   木"]
[null,"10","群   馬",null,"10群   馬"]
[null,"11","埼   玉",null,"11埼   玉"]
[null,"12","千   葉",null,"12千   葉"]
[null,"13","東   京",null,"13東   京"]
[null,"14","神奈川",null,"14神奈川"]
[null,"15","新   潟",null,"15新   潟"]
[null,"16","富   山",null,"16富   山"]
[null,"17","石   川",null,"17石   川"]
[null,"18","福   井",null,"18福   井"]
[null,"19","山   梨",null,"19山   梨"]
[null,"20","長   野",null,"20長   野"]
[null,"21","岐   阜",null,"21岐   阜"]
[null,"22","静   岡",null,"22静   岡"]
[null,"23","愛   知",null,"23愛   知"]
[null,"24","三   重",null,"24三   重"]
[null,"25","滋   賀",null,"25滋   賀"]
[null,"26","京   都",null,"26京   都"]
[null,"27","大   阪",null,"27大   阪"]
[null,"28","兵   庫",null,"28兵   庫"]
[null,"29","奈   良",null,"29奈   良"]
[null,"30","和歌山",null,"30和歌山"]
[null,"31","鳥   取",null,"31鳥   取"]
[null,"32","島   根",null,"32島   根"]
[null,"33","岡   山",null,"33岡   山"]
[null,"34","広   島",null,"34広   島"]
[null,"35","山   口",null,"35山   口"]
[null,"36","徳   島",null,"36徳   島"]
[null,"37","香   川",null,"37香   川"]
[null,"38","愛   媛",null,"38愛   媛"]
[null,"39","高   知",null,"39高   知"]
[null,"40","福   岡",null,"40福   岡"]
[null,"41","佐   賀",null,"41佐   賀"]
[null,"42","長   崎",null,"42長   崎"]
[null,"43","熊   本",null,"43熊   本"]
[null,"44","大   分",null,"44大   分"]
[null,"45","宮   崎",null,"45宮   崎"]
[null,"46","鹿児島",null,"46鹿児島"]
[null,"47","沖   縄",null,"47沖   縄"]