{"text_format":"1","workbook":"xlsx","n_sheets":4,"sheets":["様式３－２－１（学校基本情報）","様式３－２－6","（回答不要）学校コード","Sheet2"],"not_rendered":{"charts":0,"images":0,"macros":1,"external_links":3,"defined_names":14,"comments":0,"pivot_tables":0},"unopened":[],"bounds":{"document_bytes":16777216,"sheet_cells":100000,"rows_first":2000,"rows_last":500,"rows_between":2000,"halvings":0,"cell_chars":16384,"cell_head_chars":4096},"cells_cut":0,"cells_raw":0,"read":"whole","date_system":"1900"}

{"sheet":"様式３－２－１（学校基本情報）","index":0,"n_rows":25,"n_cols":14,"rows_kept":25,"cut":false,"hidden":false,"merged":[[5,1,6,1],[21,1,21,4],[24,3,26,4],[15,1,15,4],[17,1,17,4],[20,1,20,4],[16,1,16,4],[18,1,18,4],[19,1,19,4]]}
["様式３－２－１",null,null,null,"【各種学校シート】"]
["（学校の基本情報について）",null,null,null,null,null,null,null,null,null,null,null,null,"学校法人"]
[null,null,null,null,null,null,"入力チェック",null,null,null,null,null,null,"私立学校法第64条第4項の法人（いわゆる準学校法人）"]
[null,"都道府県名 1)","03岩   手",null,null,null,{"$f":"IF(C4=\"\",\"エラー\",\"OK\")","v":"OK"},null,null,null,null,null,null,"財団法人立"]
[null,"設置者名 2)",null,null,null,null,{"$f":"IF(C5=\"\",\"エラー\",\"OK\")","v":"エラー"},null,null,null,null,null,null,"社団法人立"]
[null,"設置者の種別 3)",null,null,null,null,{"$f":"IF(C6=\"\",\"エラー\",\"OK\")","v":"エラー"},null,null,null,null,null,null,"株式会社立"]
[null,null,"（その他の法人の場合：　　　　　　　　　　　　　　　　　　　　）",null,null,null,{"$f":"IF(C6=N8,IF(C7=\"（その他の法人の場合：　　　　　　　　　　　　　　　　　　　　　　　　　　　　　　　　　　）\",\"エラー\",\"OK\"),\"OK\")","v":"OK"},null,null,null,null,null,null,"その他の法人立"]
[null,"学校名",null,null,null,null,{"$f":"IF(C8=\"\",\"エラー\",\"OK\")","v":"エラー"},null,null,null,null,null,null,"個人立"]
[null,"学校コード 4)",{"$f":"IFERROR(VLOOKUP(C8,'（回答不要）学校コード'!A3:C1048,2,FALSE),\"\")","v":""},null,null,null,{"$f":"IF(C9=\"\",\"エラー\",\"OK\")","v":"エラー"},null,null,null,null,null,null,"個人立"]
[null,"法人番号 5)",null,null,null,null,"エラー"]
[null,"担当者名 6)",null,null,null,null,"エラー"]
[null,"担当者の直通電話 6)",null,null,null,null,"エラー"]
[null,"担当者のemail 6)",null,null,null,null,"エラー"]
[]
["〔注〕"]
["１）","「都道府県」の欄は、プルダウンリストから選択してください。"]
["２）","いずれかの法人立の場合は法人名を記載してください。個人立の場合は設置者である個人名を記載してください。"]
["３）","「設置者の種別」は、プルダウンリストから選択してください。「その他の法人立」を選択した場合のみ、自由記述欄に法人の種別を具体的に記載してください。"]
["４）","「学校コード」は、学校名により自動転記されますが、されない場合は「（回答不要）学校コード」シート又は以下のホームページを参考に手動での記入をお願いします。半角数字13桁、ハイフン等無しで記載してください。"]
[null,"https://www.mext.go.jp/b_menu/toukei/mext_01087.html"]
["５）","「法人番号」は、以下のホームページで確認できる、13桁の番号です。半角数字13桁、ハイフン等無しで記載してください。"]
[null,"http://www.houjin-bangou.nta.go.jp/"]
["６）","担当者の欄は、事務担当者を記載してください。回答内容について、文部科学省から個別に御連絡させていただくことがあります。"]
[]
[null,null,null,{"$f":"IF(COUNTIF(G4:G13,\"エラー\")=0,\"OK\",\"エラー\")","v":"エラー"}]

{"sheet":"様式３－２－6","index":1,"n_rows":55,"n_cols":21,"rows_kept":55,"cut":false,"hidden":false,"merged":[[35,9,37,10],[40,9,40,13],[47,19,48,19],[15,14,15,15],[15,16,15,17],[32,1,32,11],[33,1,33,11],[31,1,31,11],[14,13,14,17],[27,2,27,11],[25,1,25,11],[24,1,24,11],[30,1,30,11],[15,5,15,6],[29,1,29,11],[26,2,26,11],[28,2,28,11],[14,2,14,6],[10,0,16,1],[15,3,15,4],[3,13,3,14],[3,15,3,16],[3,17,3,18],[7,13,7,14],[8,13,8,14],[3,6,3,7],[7,6,7,7],[8,6,8,7],[3,2,3,3],[3,0,5,1],[3,4,3,5]]}
["様式３－２－６",null,null,null,null,null,null,null,null,null,null,"【各種学校シート】"]
["（各種学校の学校評価・情報公開等について）"]
[null,null,null,null,null,null,null,null,null,null,null,null,null,"未記入チェック"]
["各種学校 2)",null,"自己評価 3)①",null,"学校関係者評価 3)②",null,"第三者評価 3)③",null,null,null,null,null,null,"自己評価 3)①",null,"学校関係者評価 3)②",null,"第三者評価 3)③"]
[null,null,"実施","結果公表","実施","結果公表","実施","結果公表",null,null,null,null,null,"実施","結果公表","実施","結果公表","実施","結果公表"]
[null,null,null,null,null,null,null,null,null,null,null,null,null,{"$f":"IF(C6=\"\",\"エラー\",\"OK\")","v":"エラー"},{"$f":"IF(C6=\"している\",IF(D6=\"\",\"エラー\",\"OK\"),IF(D6=\"している\",\"エラー\",\"OK\"))","v":"OK"},{"$f":"IF(E6=\"\",\"エラー\",\"OK\")","v":"エラー"},{"$f":"IF(E6=\"している\",IF(F6=\"\",\"エラー\",\"OK\"),IF(F6=\"している\",\"エラー\",\"OK\"))","v":"OK"},{"$f":"IF(G6=\"\",\"エラー\",\"OK\")","v":"エラー"},{"$f":"IF(G6=\"している\",IF(H6=\"\",\"エラー\",\"OK\"),IF(H6=\"している\",\"エラー\",\"OK\"))","v":"OK"}]
[null,null,null,null,null,null,"↓「している」の場合 4)"]
[null,null,null,null,null,null,"実施機関名（自由記述）",null,null,null,null,null,null,"実施機関名（自由記述）"]
[null,null,null,null,null,null,null,null,null,null,null,null,null,{"$f":"IF(G6=\"している\",IF(G9=\"\",\"エラー\",\"OK\"),\"OK\")","v":"OK"}]
[]
["各種学校 2)",null,"情報公開 5)",null,null,null,null,null,null,null,null,null,null,"情報公開 5)"]
[null,null,"実施",null,null,null,null,null,null,null,null,null,null,"実施"]
[null,null,null,null,null,null,null,null,null,null,null,null,null,{"$f":"IF(C13=\"\",\"エラー\",\"OK\")","v":"エラー"}]
[null,null,"↓「している」の場合 6)"]
[null,null,"財務情報等7)の公開",null,null,null,null,null,null,null,null,null,null,"財務情報等7)の公開"]
[null,null,"一般公開 8) を行っているか。","以下の方法で公開しているか（複数選択可）。",null,"以下の情報の公開を行っているか（複数選択可）。",null,null,null,null,null,null,null,"一般公開 8) を行っているか。","以下の方法で公開しているか（複数選択可）。",null,"以下の情報の公開を行っているか（複数選択可）。"]
[null,null,null,"設置者若しくは学校のホームページに掲載",null,"財産目録",null,null,null,null,null,null,null,{"$f":"IF($C$13=\"している\",IF(C17=\"\",\"エラー\",\"OK\"),IF(C17=\"している\",\"エラー\",\"OK\"))","v":"OK"},"設置者若しくは学校のホームページに掲載",{"$f":"IF($C$13=\"している\",IF(E17=\"\",\"エラー\",\"OK\"),IF(E17=\"している\",\"エラー\",\"OK\"))","v":"OK"},"財産目録",{"$f":"IF($C$13=\"している\",IF(G17=\"\",\"エラー\",\"OK\"),IF(G17=\"している\",\"エラー\",\"OK\"))","v":"OK"}]
[null,null,null,"広報誌等の刊行物に掲載",null,"貸借対照表",null,null,null,null,null,null,null,null,"広報誌等の刊行物に掲載",{"$f":"IF($C$13=\"している\",IF(E18=\"\",\"エラー\",\"OK\"),IF(E18=\"している\",\"エラー\",\"OK\"))","v":"OK"},"貸借対照表",{"$f":"IF($C$13=\"している\",IF(G18=\"\",\"エラー\",\"OK\"),IF(G18=\"している\",\"エラー\",\"OK\"))","v":"OK"}]
[null,null,null,"学内掲示板等の掲示",null,"収支計算書",null,null,null,null,null,null,null,null,"学内掲示板等の掲示",{"$f":"IF($C$13=\"している\",IF(E19=\"\",\"エラー\",\"OK\"),IF(E19=\"している\",\"エラー\",\"OK\"))","v":"OK"},"収支計算書",{"$f":"IF($C$13=\"している\",IF(G19=\"\",\"エラー\",\"OK\"),IF(G19=\"している\",\"エラー\",\"OK\"))","v":"OK"}]
[null,null,null,"その他",null,"事業報告書",null,null,null,null,null,null,null,null,"その他",{"$f":"IF($C$13=\"している\",IF(E20=\"\",\"エラー\",\"OK\"),IF(E20=\"している\",\"エラー\",\"OK\"))","v":"OK"},"事業報告書",{"$f":"IF($C$13=\"している\",IF(G20=\"\",\"エラー\",\"OK\"),IF(G20=\"している\",\"エラー\",\"OK\"))","v":"OK"}]
[null,null,null,null,null,"監査報告書",null,null,null,null,null,null,null,null,null,null,"監査報告書",{"$f":"IF($C$13=\"している\",IF(G21=\"\",\"エラー\",\"OK\"),IF(G21=\"している\",\"エラー\",\"OK\"))","v":"OK"}]
[]
["〔注〕"]
["１）","黄色に着色されたセルについて「している」又は「していない」等選択肢から該当するものを選択してください。"]
["２）","「自己評価」、「学校関係者評価」、「第三者評価」、「情報公開」の項目は、今年度中に実施または結果公表をした場合には「している」を選択してください。例えば、今年度中に昨年度を対象とした評価又は情報公開を実施した場合は「している」を記入してください（なお、昨年度を対象とした評価又は情報公開を今年度の5月1日までに実施した場合、また、その結果を公表した場合を含みます）。"]
["３）","「自己評価」「学校関係者評価」「第三者評価」の欄には、以下に示す各評価について、実施及び結果公表をしているかどうか記入してください。\nなお、結果公表については、学校のホームページにおける公表に限らず、学校において閲覧に供する等でも構いません。例えば、学校便りに掲載する、PTA総会等の機会に保護者に対する説明を実施する、地域住民等が閲覧可能な場所に掲示する等も含みます。\nなお、自己評価の実施及び結果公表は法令上の義務であり、学校関係者評価の実施及び結果公表は法令上の努力義務です。"]
[null,"①","「自己評価」とは、学校教育法施行規則第66条（第189条及び第190条において、専修学校及び各種学校に準用。）の規定による、自己評価（教育活動その他の学校運営の状況について、自ら評価）を行うものであること。"]
[null,"②","「学校関係者評価」とは、学校教育法施行規則第67条（第189条及び第190条において、専修学校及び各種学校に準用。）の規定による、学校関係者評価（自己評価の結果を踏まえた当該校の生徒の保護者その他の当該校の関係者（当該校の職員を除く。）による評価）を行うものであること。"]
[null,"③","「第三者評価」とは、学校とその設置者が実施者となり、学校運営に関する外部の専門家を中心とした、当該学校から独立した第三者が、自己評価や学校関係者評価の実施状況も踏まえつつ、教育活動その他の学校運営の状況について、当該第三者が設定する評価基準に基づき、専門的・客観的視点から行う評価のこと。"]
["４）","「第三者評価」について「している」を選択した場合には、具体的な実施機関名を記載してください（自由記述）。"]
["５）","「情報公開」とは、学校教育法第43条（第133条及び第134条において、専修学校及び各種学校に準用。）に基づき教育活動その他の学校運営の状況に関する情報の提供を行うものであることをいいます。\nなお、学校のホームページにおける情報公開に限らず、学校において閲覧に供する等でも構いません。例えば、学校便りに掲載する、PTA総会等の機会に保護者に対する説明を実施する、地域住民等が閲覧可能な場所に掲示する等も含みます。"]
["６）","「情報公開」について「している」を選択した場合には、そのうち、財務情報等の公開に関する情報についても回答してください。"]
["７）","「財務情報等」とは一昨年度終了後2月以内に作成した財産目録、貸借対照表、収支計算書、事業報告書（それぞれの概要を含む）及び監査報告書をいいます。"]
["８）","「一般公開｣とは、「利害関係人への閲覧」以外で、広く一般（受験生等を含む。）に対し、学校法人等のホームページへの掲載、広報誌等の刊行物（パンフレット類を含む。）への掲載等の方法により、財務情報等を公開することをいう。"]
[]
[null,null,null,null,null,null,null,null,null,{"$f":"IF(COUNTIF(N:S,\"エラー\")=0,\"OK\",\"エラー\")","v":"エラー"}]
[]
[]
[]
[]
[null,null,null,null,null,null,null,null,null,{"$f":"IF(J36=\"エラー\",\"未記入の欄があります。確認してください。,\"\"\")","v":"未記入の欄があります。確認してください。,\""}]
[]
[]
[]
[]
[null,null,null,null,null,null,null,null,null,null,null,null,null,null,null,null,null,null,null,"都道府県名 1)",{"$f":"'様式３－２－１（学校基本情報）'!$C$4","v":"03岩   手"}]
[null,null,null,null,null,null,null,null,null,null,null,null,null,null,null,null,null,null,null,"設置者名",{"$f":"'様式３－２－１（学校基本情報）'!$C$5","v":0}]
[null,null,null,null,null,null,null,null,null,null,null,null,null,null,null,null,null,null,null,"設置者の種別 2)",{"$f":"'様式３－２－１（学校基本情報）'!$C$6","v":0}]
[null,null,null,null,null,null,null,null,null,null,null,null,null,null,null,null,null,null,null,null,{"$f":"'様式３－２－１（学校基本情報）'!$C$7","v":"（その他の法人の場合：　　　　　　　　　　　　　　　　　　　　）"}]
[null,null,null,null,null,null,null,null,null,null,null,null,null,null,null,null,null,null,null,"学校名",{"$f":"'様式３－２－１（学校基本情報）'!$C$8","v":0}]
[null,null,null,null,null,null,null,null,null,null,null,null,null,null,null,null,null,null,null,"学校コード 3)",{"$f":"'様式３－２－１（学校基本情報）'!$C$9","v":""}]
[null,null,null,null,null,null,null,null,null,null,null,null,null,null,null,null,null,null,null,"法人番号 4)",{"$f":"'様式３－２－１（学校基本情報）'!$C$10","v":0}]
[null,null,null,null,null,null,null,null,null,null,null,null,null,null,null,null,null,null,null,"担当者名 5)",{"$f":"'様式３－２－１（学校基本情報）'!$C$11","v":0}]
[null,null,null,null,null,null,null,null,null,null,null,null,null,null,null,null,null,null,null,"担当者の直通電話",{"$f":"'様式３－２－１（学校基本情報）'!$C$12","v":0}]
[null,null,null,null,null,null,null,null,null,null,null,null,null,null,null,null,null,null,null,"担当者のemail",{"$f":"'様式３－２－１（学校基本情報）'!$C$13","v":0}]

{"sheet":"（回答不要）学校コード","index":2,"n_rows":1048,"n_cols":3,"rows_kept":1048,"cut":false,"hidden":false,"merged":[]}
["文部科学省　学校コード（各種学校）"]
["学校名","学校コード","都道府県番号"]
["北海道文化高等編物学院","H201310100011","01(北海道)"]
["中央編物学校","H201310100020","01(北海道)"]
["中村編物技芸学園","H201310100039","01(北海道)"]
["北都編物服飾専門学院","H201310100048","01(北海道)"]
["北海道治療医学校","H201310100057","01(北海道)"]
["河合塾札幌校","H201310200010","01(北海道)"]
["北海道高等技能専修学校","H201310200029","01(北海道)"]
["札幌篠路自動車学校","H201310200038","01(北海道)"]
["幌北編物服装学院","H201310200047","01(北海道)"]
["創研学園看予備","H201310200056","01(北海道)"]
["駿台予備学校札幌校","H201310200065","01(北海道)"]
["大学受験予備校クラズユニック","H201310200074","01(北海道)"]
["札幌高等英語学院","H201310300019","01(北海道)"]
["北海道インターナショナルスクール","H201310500017","01(北海道)"]
["札幌井上速算学校","H201310500026","01(北海道)"]
["月寒洋裁女学院","H201310500035","01(北海道)"]
["札幌東自動車学校","H201310500044","01(北海道)"]
["北海道自動車学校","H201310500053","01(北海道)"]
["札幌高等実践学校","H201310500062","01(北海道)"]
["北海道朝鮮初中高級学校","H201311000010","01(北海道)"]
["五稜洋裁学院","H201320200019","01(北海道)"]
["函館ふじ文化服装学院","H201320200028","01(北海道)"]
["吉田服装女学校","H201320200037","01(北海道)"]
["道南編物服装学院","H201320200046","01(北海道)"]
["函館進学学院","H201320200055","01(北海道)"]
["鈴蘭文化洋裁学院","H201320200064","01(北海道)"]
["石田レディス洋裁学院","H201320200073","01(北海道)"]
["小樽ドレスメーカー女学院","H201320300018","01(北海道)"]
["北海道クミアイ自動車学校","H201320400017","01(北海道)"]
["道東自動車学校","H201320600015","01(北海道)"]
["帯広美術工芸学院","H201320700014","01(北海道)"]
["網走自動車学校","H201321100018","01(北海道)"]
["北海道農業協同組合学校","H201321700012","01(北海道)"]
["赤平ドレスメーカー女学院","H201321800011","01(北海道)"]
["千歳速算学校","H201322400013","01(北海道)"]
["深川医師会附属准看護学院","H201322800019","01(北海道)"]
["室蘭総合自動車学校","H201323000015","01(北海道)"]
["恵庭速算学校","H201323100014","01(北海道)"]
["北海道高等洋服女学院","H201323100023","01(北海道)"]
["八雲自動車学校","H201334600016","01(北海道)"]
["檜山服装学院","H201336100016","01(北海道)"]
["北海道インターナショナルスクール・ニセコ校","H201339500016","01(北海道)"]
["岩内ドレスメーカー女学院","H201340200017","01(北海道)"]
["昭和洋裁女学院角田分院","H201342900016","01(北海道)"]
["北海洋裁専門学校","H201343000013","01(北海道)"]
["沼田和裁学院","H201343800015","01(北海道)"]
["笹森服装学院","H201345900019","01(北海道)"]
["岩谷学園ひがし北海道日本語学校","H201389200014","01(北海道)"]
["青森市医師会立青森准看護学院","H202310000011","02(青森)"]
["青森タイピスト養成所","H202310000020","02(青森)"]
["木村簿記経理学校","H202310000039","02(青森)"]
["鷹揚ゼミナール","H202310000057","02(青森)"]
["Ｓ．Ｋ．Ｋ．弘前予備校","H202310000066","02(青森)"]
["八戸市医師会立八戸准看護学院","H202310000075","02(青森)"]
["五所川原予備校","H202310000084","02(青森)"]
["済誠会附属十和田准看護学院","H202310000093","02(青森)"]
["仁和会三沢中央病院附属准看護学院","H202310000100","02(青森)"]
["東北外語学院","H202310000119","02(青森)"]
["アシノ音楽学苑","H203320100018","03(岩手)"]
["関谷珠算学校","H203320100027","03(岩手)"]
["盛岡市医師会附属盛岡准看護学院","H203320100036","03(岩手)"]
["岩手第一珠算学校","H203320100045","03(岩手)"]
["盛岡市医師会附属盛岡高等看護学院","H203320100054","03(岩手)"]
["第一珠算学校","H203320600013","03(岩手)"]
["仙台ア－トスク－ルメロン","H204391010017","04(宮城)"]
["環球日本語学習院","H204391010026","04(宮城)"]
["東洋国際文化アカデミー","H204391010035","04(宮城)"]
["未来の杜学園","H204391010044","04(宮城)"]
["仙台国際日本語学校","H204391010053","04(宮城)"]
["理知の杜日本語学校仙台校","H204391010062","04(宮城)"]
["駿台予備学校仙台校","H204391020015","04(宮城)"]
["東北朝鮮初中高級学校","H204391040011","04(宮城)"]
["東北インターナショナルスクール","H204391050018","04(宮城)"]
["ホライゾンジャパンインターナショナルスクール仙台","H204391050027","04(宮城)"]
["石巻市医師会附属准看護学校","H204392020013","04(宮城)"]
["塩釜医師会附属准看護学院","H204392030011","04(宮城)"]
["気仙沼市医師会附属准看護学校","H204392050016","04(宮城)"]
["気仙沼市医師会附属高等看護学校","H204392050025","04(宮城)"]
["角田明和女学院","H204392080010","04(宮城)"]
["宮城高等技芸学院","H204392080029","04(宮城)"]
["医療法人社団スズキ病院附属助産学校","H204392110014","04(宮城)"]
["佐沼経理学校","H204392120012","04(宮城)"]
["大崎市医師会附属准看護学校","H204392150015","04(宮城)"]
["大崎市医師会附属高等看護学校","H204392150024","04(宮城)"]
["奥山編物学院","H204392150033","04(宮城)"]
["川崎和洋裁女学院","H204393240015","04(宮城)"]
["大郷女子技芸学校","H204394220017","04(宮城)"]
["秋田日本語学院","H205320100034","05(秋田)"]
["大場珠算簿記学校","H205320600020","05(秋田)"]
["アキタインターナショナルペットスクール","H205321000015","05(秋田)"]
["山形理容学校","H206320181017","06(山形)"]
["明徳予備校","H206320181035","06(山形)"]
["鶴岡准看護学院","H206320381015","06(山形)"]
["第一貨物流通技能専門校","H206321081016","06(山形)"]
["公立双葉准看護学院","H207254690011","07(福島)"]
["学校法人福島朝鮮学園福島朝鮮初中級学校","H207320391012","07(福島)"]
["学校法人尚志学園福島高等予備校","H207320391021","07(福島)"]
["駿優予備学校郡山校","H207320391030","07(福島)"]
["平成人学校","H207320491011","07(福島)"]
["いわき市医師会附属いわき准看護学校","H207320491020","07(福島)"]
["日本太平自動車学校","H207320491039","07(福島)"]
["常磐音楽舞踊学院","H207320491048","07(福島)"]
["いわき高等タイピスト学校","H207320491057","07(福島)"]
["修学館","H207321091013","07(福島)"]
["矢吹和裁学校","H207346691014","07(福島)"]
["茨城朝鮮初中高級学校","H208320100013","08(茨城)"]
["杉山編物技芸学院","H208320100022","08(茨城)"]
["水戸駿優予備学校","H208320100031","08(茨城)"]
["水戸筑波ゼミナール","H208320100040","08(茨城)"]
["土浦市医師会附属准看護学院","H208320300011","08(茨城)"]
["古河和装専門学院","H208320400010","08(茨城)"]
["サクラ服装学院","H208320500019","08(茨城)"]
["ＴＳＵＫＵＢＡＩＮＴＥＲＮＡＴＩＯＮＡＬＳＣＨＯＯＬ","H208322000010","08(茨城)"]
["日本つくば国際語学院","H208322000029","08(茨城)"]
["鹿島医師会附属准看護学院","H208322200018","08(茨城)"]
["真壁医師会准看護学院","H208322700013","08(茨城)"]
["下館文化服装学院","H208322700022","08(茨城)"]
["宇都宮服装文化学院","H209310000014","09(栃木)"]
["増美文化服装学院","H209310000023","09(栃木)"]
["こだま文化服装学院","H209310000032","09(栃木)"]
["日本簿記学校","H209310000041","09(栃木)"]
["小山珠算学院","H209310000050","09(栃木)"]
["真岡珠算簿記学校","H209310000069","09(栃木)"]
["見目計算実務学校","H209310000087","09(栃木)"]
["宇都宮病院附属准看護学校","H209310000096","09(栃木)"]
["足利市医師会付属准看護学校","H209310000103","09(栃木)"]
["佐野市医師会附属佐野准看護学校","H209310000112","09(栃木)"]
["上都賀郡市医師会附属准看護学校","H209310000121","09(栃木)"]
["昇玉学院","H209310000130","09(栃木)"]
["栃木県自動車学校","H209310000149","09(栃木)"]
["宇都宮タイピスト学院","H209310000158","09(栃木)"]
["栃木朝鮮初中級学校","H209310000167","09(栃木)"]
["好学院国際学校","H209310000176","09(栃木)"]
["セントメリー日本語学院","H209310000185","09(栃木)"]
["駒形珠算学校","H210310000011","10(群馬)"]
["前橋市医師会立前橋准看護学校","H210310000020","10(群馬)"]
["前橋ニュースタイル編物学院","H210310000039","10(群馬)"]
["ＮＩＰＰＯＮ文化学院","H210310000048","10(群馬)"]
["ＮＩＰＰＯＮ語学院","H210310000057","10(群馬)"]
["群馬朝鮮初中級学校","H210310000066","10(群馬)"]
["ＮＩＰＰＯＮ進学院","H210310000075","10(群馬)"]
["柘植珠算学校","H210310000084","10(群馬)"]
["小野池学院","H210310000093","10(群馬)"]
["桐生市医師会立桐生准看護学校","H210310000100","10(群馬)"]
["群馬和裁専門学院","H210310000119","10(群馬)"]
["あけぼの珠算学校","H210310000128","10(群馬)"]
["エスコーラパラレロ各種学校","H210310000137","10(群馬)"]
["伯人学校イーエーエス太田","H210310000146","10(群馬)"]
["沼田准看護学校","H210310000155","10(群馬)"]
["藤岡准看護学校","H210310000164","10(群馬)"]
["富岡市甘楽郡医師会立富岡准看護学校","H210310000173","10(群馬)"]
["安中市医師会立安中准看護学校","H210310000182","10(群馬)"]
["吾妻郡医師会立吾妻准看護学校","H210310000191","10(群馬)"]
["大宮医師会立大宮准看護学校","H211310200018","11(埼玉)"]
["埼玉県自動車学校","H211310200027","11(埼玉)"]
["大宮珠算学校","H211310300017","11(埼玉)"]
["埼玉朝鮮初中級学校","H211310300035","11(埼玉)"]
["埼玉日本語学校","H211310300053","11(埼玉)"]
["新藤花道学院","H211310700013","11(埼玉)"]
["武蔵浦和日本語学院","H211310800012","11(埼玉)"]
["山手日本語学校","H211320100018","11(埼玉)"]
["熊谷准看護学校","H211320200017","11(埼玉)"]
["鳩ケ谷珠算学校","H211320300016","11(埼玉)"]
["所沢市医師会立所沢准看護学院","H211320800011","11(埼玉)"]
["飯能研修学院","H211320900010","11(埼玉)"]
["本庄准看護学校","H211321100016","11(埼玉)"]
["東松山自動車学校","H211321200015","11(埼玉)"]
["比企准看護学校","H211321200024","11(埼玉)"]
["狭山市医師会立狭山准看護学校","H211321500012","11(埼玉)"]
["羽生高等簿記珠算学校","H211321600011","11(埼玉)"]
["北埼玉医師会准看護学校","H211321600020","11(埼玉)"]
["鴻巣准看護学校","H211321700010","11(埼玉)"]
["草加八潮医師会准看護学校","H211322100014","11(埼玉)"]
["入間准看護学校","H211322500010","11(埼玉)"]
["朝霞准看護学校","H211322700018","11(埼玉)"]
["桶川北本伊奈地区医師会立准看護学校","H211323300010","11(埼玉)"]
["各種学校インスチトゥトエドゥカシオナルティーエスレクレアソン","H211338500016","11(埼玉)"]
["千葉朝鮮初中級学校","H212310000019","12(千葉)"]
["若宮珠算学校","H212310000046","12(千葉)"]
["ふなばし美術学院","H212310000064","12(千葉)"]
["松戸第一珠算学校","H212310000073","12(千葉)"]
["馬橋珠算学校","H212310000082","12(千葉)"]
["藤工房和裁学院","H212310000091","12(千葉)"]
["石塚文化服装学院","H212310000117","12(千葉)"]
["一般社団法人香取郡市医師会附属佐原准看護学校","H212310000126","12(千葉)"]
["大塚ドレスメーカー女学院","H212310000135","12(千葉)"]
["全国漁業協同組合学校","H212310000144","12(千葉)"]
["日本語国際学院","H212310000153","12(千葉)"]
["市原女子服装学院","H212310000162","12(千葉)"]
["越川裁縫女學校","H212310000171","12(千葉)"]
["夷隅准看護師学校","H212310000180","12(千葉)"]
["御茶の水美術学院","H213310100017","13(東京)"]
["千代田予備校","H213310100026","13(東京)"]
["東京中華学校","H213310100035","13(東京)"]
["東京會舘クッキングスクール","H213310100053","13(東京)"]
["ドレスメーカーシック女学院","H213310100062","13(東京)"]
["神田静修学院","H213310100071","13(東京)"]
["アートマスターズスクール","H213310200016","13(東京)"]
["東京仏教学院","H213310200025","13(東京)"]
["東京ギャラクシー日本語学校","H213310200034","13(東京)"]
["東亜学院","H213310300015","13(東京)"]
["東京インターナショナルスクール","H213310300024","13(東京)"]
["西町インターナショナルスクール","H213310300033","13(東京)"]
["白金自由学園","H213310300042","13(東京)"]
["カルチャーセンター・米会話学院","H213310300051","13(東京)"]
["アメリカン・スクール・イン・ジャパン・アーリーラーニングセンター","H213310300060","13(東京)"]
["合気道学校","H213310400014","13(東京)"]
["江上料理学院","H213310400032","13(東京)"]
["キルビー学院","H213310400041","13(東京)"]
["日本学生支援機構東京日本語教育センター","H213310400050","13(東京)"]
["ＫＣＰ地球市民日本語学校","H213310400069","13(東京)"]
["白百合ドレスメーカー女学院","H213310400078","13(東京)"]
["新宿クッキングアカデミー","H213310400087","13(東京)"]
["東京編物学院","H213310400096","13(東京)"]
["東京韓国学校初等部","H213310400103","13(東京)"]
["東京韓国学校中・高等部","H213310400112","13(東京)"]
["東京正生学院","H213310400121","13(東京)"]
["日本聖書神学校","H213310400130","13(東京)"]
["一橋学院早慶外語","H213310400149","13(東京)"]
["新宿経理学校","H213310400158","13(東京)"]
["千駄ヶ谷日本語学校","H213310400167","13(東京)"]
["新宿日本語学校","H213310400176","13(東京)"]
["東京国際大学付属日本語学校","H213310400185","13(東京)"]
["赤堀料理学園","H213310500013","13(東京)"]
["学校講道館","H213310500022","13(東京)"]
["東京クリーニング学校","H213310500031","13(東京)"]
["東邦音楽学校","H213310500040","13(東京)"]
["共立日語学院","H213310500059","13(東京)"]
["ＡＢＫ学館日本語学校","H213310500068","13(東京)"]
["ＡＲＣ東京日本語学校","H213310500077","13(東京)"]
["母子保健研修センター助産師学校","H213310500086","13(東京)"]
["東京舞踊学校","H213310600012","13(東京)"]
["日本珠算学校","H213310600021","13(東京)"]
["吉澤珠算学校","H213310600030","13(東京)"]
["東京明生日本語学院","H213310700011","13(東京)"]
["東京朝鮮第５初中級学校","H213310700020","13(東京)"]
["向島珠算学校","H213310700039","13(東京)"]
["渡辺珠算学校","H213310700048","13(東京)"]
["秀林日本語学校","H213310700057","13(東京)"]
["理知の杜日本語学校東京校","H213310700066","13(東京)"]
["インディアインターナショナルスクールインジャパン","H213310800029","13(東京)"]
["カナン国際教育学院","H213310800038","13(東京)"]
["東京朝鮮第２幼初級学校","H213310800047","13(東京)"]
["ケイ・インターナショナルスクール東京","H213310800056","13(東京)"]
["日本高等洋裁学院","H213310900019","13(東京)"]
["アサヒドレスメーカー女学院","H213311000016","13(東京)"]
["聖契神学校","H213311000025","13(東京)"]
["レーヌ総合美容学院","H213311000034","13(東京)"]
["池上珠算学校","H213311100015","13(東京)"]
["東京工科大学附属日本語学校","H213311100024","13(東京)"]
["こまどり芸術学園","H213311100033","13(東京)"]
["宗教法人「総本山長生寺」付属長生学園","H213311100042","13(東京)"]
["東京朝鮮第６幼初級学校","H213311100051","13(東京)"]
["東京トランスナショナル日本語学校","H213311100060","13(東京)"]
["青谷珠算学校","H213311200014","13(東京)"]
["セント・メリーズ・インターナショナル・スクール","H213311200023","13(東京)"]
["サカモトミュージックスクール","H213311200032","13(東京)"]
["自由ケ丘お料理学校","H213311200041","13(東京)"]
["成城国際文化学校","H213311200050","13(東京)"]
["聖公会神学院","H213311200069","13(東京)"]
["服部珠算学校","H213311200078","13(東京)"]
["清泉インターナショナル学園","H213311200096","13(東京)"]
["ブリティッシュ・スクール・イン・トウキョウ昭和","H213311200103","13(東京)"]
["山野日本語学校","H213311300013","13(東京)"]
["ドルトンスクール東京","H213311300022","13(東京)"]
["善隣書院","H213311300031","13(東京)"]
["かこうインターナショナルデザインカレッジ国際手芸学院","H213311300040","13(東京)"]
["安達挿花芸術学院","H213311300059","13(東京)"]
["カッティングスクール","H213311300068","13(東京)"]
["聖心インターナショナルスクール","H213311300077","13(東京)"]
["東京人形学院","H213311300086","13(東京)"]
["東京イングリッシュセンター","H213311300095","13(東京)"]
["東京工学院日本語学校","H213311300102","13(東京)"]
["東京高等ダンス学校","H213311300111","13(東京)"]
["東京日本語学校","H213311300120","13(東京)"]
["代々木情報経理学校","H213311300139","13(東京)"]
["ブリティッシュ・スクール・イン東京","H213311300148","13(東京)"]
["梅若能楽学院","H213311400012","13(東京)"]
["東京スピーチ・クリニック","H213311400021","13(東京)"]
["東京療術専修学校","H213311400030","13(東京)"]
["マドモアゼル洋裁学園","H213311400049","13(東京)"]
["イーストウエスト日本語学校","H213311400058","13(東京)"]
["東京朝鮮第９初級学校","H213311500011","13(東京)"]
["武蔵野服装学院","H213311500020","13(東京)"]
["駿河台洋和裁学院","H213311600010","13(東京)"]
["千駄ヶ谷外語学院","H213311600029","13(東京)"]
["中央聖書神学校","H213311600038","13(東京)"]
["東京編物技芸学校","H213311600047","13(東京)"]
["帝京平成大学附属日本語学校","H213311600056","13(東京)"]
["ニューインターナショナルスクールオブジャパン","H213311600065","13(東京)"]
["武蔵高等予備校","H213311600074","13(東京)"]
["メロス言語学院","H213311600083","13(東京)"]
["ＩＳＩ外語カレッジ","H213311600092","13(東京)"]
["東京国際フランス学園","H213311700019","13(東京)"]
["赤羽珠算学校","H213311700028","13(東京)"]
["石川珠算学校","H213311700037","13(東京)"]
["高島珠算学校","H213311700046","13(東京)"]
["都北珠算学校","H213311700055","13(東京)"]
["東京文化綜合学院","H213311700064","13(東京)"]
["東京朝鮮中高級学校","H213311700073","13(東京)"]
["中央工学校附属日本語学校","H213311700082","13(東京)"]
["堀口珠算学校","H213311700091","13(東京)"]
["赤羽學園","H213311700108","13(東京)"]
["安部珠算簿記学校","H213311700117","13(東京)"]
["薬学研修学校","H213311700126","13(東京)"]
["東京外語学園日本語学校","H213311700135","13(東京)"]
["東京小石川日本語学校","H213311700144","13(東京)"]
["ジェット日本語学校","H213311700153","13(東京)"]
["東京朝鮮第１幼初中級学校","H213311800018","13(東京)"]
["赤門会日本語学校本校","H213311800027","13(東京)"]
["赤門会日本語学校日暮里校","H213311800036","13(東京)"]
["富士日本語学校","H213311900017","13(東京)"]
["落合珠算学校","H213311900026","13(東京)"]
["東京朝鮮第３初級学校","H213311900035","13(東京)"]
["淑徳日本語学校","H213311900044","13(東京)"]
["東京手芸編物学校","H213312000014","13(東京)"]
["足立珠算学校","H213312100013","13(東京)"]
["浅野珠算学校","H213312100022","13(東京)"]
["内田服装文化学院","H213312100031","13(東京)"]
["東京朝鮮第４幼初中級学校","H213312100040","13(東京)"]
["博慈会高等看護学院","H213312100059","13(東京)"]
["松山珠算学校","H213312100068","13(東京)"]
["ＳＡＮＫＯ日本語学校綾瀬","H213312100077","13(東京)"]
["柴又珠算学校","H213312200012","13(東京)"]
["三浦珠算学校","H213312200021","13(東京)"]
["大原日本語学院","H213312300011","13(東京)"]
["東洋言語学院","H213312300020","13(東京)"]
["開智国際日本語学校","H213320100016","13(東京)"]
["西東京朝鮮第１幼初中級学校","H213320200015","13(東京)"]
["日本クッキングスクール","H213320200024","13(東京)"]
["すみれ学園","H213320300014","13(東京)"]
["日本ルーテル神学校","H213320400013","13(東京)"]
["多摩ドレスメーカー女学院","H213320500012","13(東京)"]
["アメリカン・スクール・イン・ジャパン","H213320800019","13(東京)"]
["西東京朝鮮第２幼初級学校","H213320900018","13(東京)"]
["農村伝道神学校","H213320900027","13(東京)"]
["中野洋裁学院","H213321000015","13(東京)"]
["朝鮮大学校","H213321100014","13(東京)"]
["日野珠算学校","H213321200013","13(東京)"]
["農業科学化研究所","H213321500010","13(東京)"]
["国際交流日本語学校","H213321500029","13(東京)"]
["クリスチャン・アカデミー・イン・ジャパン","H213322200011","13(東京)"]
["自由学園最高学部","H213322200020","13(東京)"]
["黎明婦人文化学院","H213330300013","13(東京)"]
["鶴見朝鮮初級学校","H214310000017","14(神奈川)"]
["ホライゾンジャパンインターナショナルスクール","H214310000026","14(神奈川)"]
["神奈川朝鮮中高級学校","H214310000035","14(神奈川)"]
["横浜朝鮮初級学校","H214310000044","14(神奈川)"]
["サンモールインターナショナルスクール","H214310000053","14(神奈川)"]
["横浜インターナショナルスクール","H214310000062","14(神奈川)"]
["横濱中華學院","H214310000071","14(神奈川)"]
["横浜山手中華学校","H214310000080","14(神奈川)"]
["杉野洋裁研究所","H214310000099","14(神奈川)"]
["東京横浜独逸学園","H214310000106","14(神奈川)"]
["川崎朝鮮初中級学校","H214313000011","14(神奈川)"]
["南武朝鮮初級学校","H214313000020","14(神奈川)"]
["新潟朝鮮初中級学校","H215310000016","15(新潟)"]
["新潟国際藝術学院","H215310000025","15(新潟)"]
["エイシン長岡日本語学校","H215320200013","15(新潟)"]
["新潟聖書学院","H215320500010","15(新潟)"]
["佐渡国際教育学院","H215322400017","15(新潟)"]
["富山自動車学校","H216320185011","16(富山)"]
["北日本自動車学校","H216320185020","16(富山)"]
["富山音楽院","H216320185039","16(富山)"]
["富山県中央自動車学校","H216320185048","16(富山)"]
["富山中部自動車学校","H216320185057","16(富山)"]
["呉羽自動車学校","H216320185066","16(富山)"]
["富山ＯＡスクール","H216320185075","16(富山)"]
["富山予備校","H216320185084","16(富山)"]
["高岡自動車学校","H216320285010","16(富山)"]
["高新自動車学校","H216320285029","16(富山)"]
["北陸自動車学校","H216320285038","16(富山)"]
["氷見自動車学校","H216320585017","16(富山)"]
["滑川自動車学校","H216320685016","16(富山)"]
["黒部自動車学校","H216320785015","16(富山)"]
["砺波自動車学校","H216320885014","16(富山)"]
["砺波准看護学院","H216320885023","16(富山)"]
["総合カレッジＳＥＯ","H216320885032","16(富山)"]
["小矢部自動車学校","H216320985013","16(富山)"]
["南砺自動車学校","H216321085010","16(富山)"]
["福光珠算学校","H216321085029","16(富山)"]
["富山県第一自動車学校","H216321185019","16(富山)"]
["入善自動車学校","H216334285011","16(富山)"]
["泉丘文化服装学院","H217320100012","17(石川)"]
["石川高等編物学校","H217320100021","17(石川)"]
["青木クッキングスクール","H217320100030","17(石川)"]
["大徳自動車学校","H217320100049","17(石川)"]
["東部自動車学校","H217320100058","17(石川)"]
["ドライビングスクールエクシール城東","H217320100067","17(石川)"]
["金沢中央予備校","H217320100076","17(石川)"]
["金沢駅西予備校","H217320100085","17(石川)"]
["かなざわ和裁学院","H217320100094","17(石川)"]
["七尾自動車学校","H217320200011","17(石川)"]
["石川県加南自動車学校","H217320300010","17(石川)"]
["こまつ自動車学校","H217320300029","17(石川)"]
["小松市医師会附属小松准看護学院","H217320300038","17(石川)"]
["輪島綜合自動車学校","H217320400019","17(石川)"]
["加賀自動車学校","H217320600017","17(石川)"]
["千里浜なぎさドライビングスクール","H217320700016","17(石川)"]
["太陽自動車学校","H217320900014","17(石川)"]
["北陸中部自動車学校","H217321000011","17(石川)"]
["北鉄自動車学校","H217321200019","17(石川)"]
["能登自動車学校","H217346300015","17(石川)"]
["奥田料理学院","H218310000013","18(福井)"]
["福井自動車学校","H218310000022","18(福井)"]
["学校法人あおい学園ＡＯＩドライビングスクール福井校","H218310000031","18(福井)"]
["北陸自動車学校","H218310000040","18(福井)"]
["学校法人福井自動車学園敦賀自動車学校","H218310000059","18(福井)"]
["武生自動車学校","H218310000068","18(福井)"]
["小浜自動車学校","H218310000077","18(福井)"]
["大野自動車学校","H218310000086","18(福井)"]
["学校法人あおい学園ＡＯＩドライビングスクール勝山校","H218310000095","18(福井)"]
["サカイドライビングスクール","H218310000102","18(福井)"]
["北陸朝鮮初中級学校","H218310000111","18(福井)"]
["学校法人あおい学園ＡＯＩドライビングスクール敦賀校","H218310000120","18(福井)"]
["日本女子技術学院","H219310000012","19(山梨)"]
["甲府ドレスメーカー女学院","H219310000030","19(山梨)"]
["山梨ＹＭＣＡ英語学校","H219310000049","19(山梨)"]
["野口料理学園","H219310000058","19(山梨)"]
["篠原音楽学園","H219310000067","19(山梨)"]
["和田女学院","H219310000076","19(山梨)"]
["ヱスケイ技芸学院","H219310000085","19(山梨)"]
["今福珠算学校","H219310000094","19(山梨)"]
["各種学校クレアーレナカヤマ","H219310000101","19(山梨)"]
["山梨コンピューター学院","H219310000110","19(山梨)"]
["ユニタス日本語学校","H219310000129","19(山梨)"]
["長野スクールオブビジネス","H220320100017","20(長野)"]
["長野予備学校","H220320100026","20(長野)"]
["長野ビジネスアカデミー","H220320100035","20(長野)"]
["竹原珠算学校","H220320100044","20(長野)"]
["松本大学予備校","H220320200016","20(長野)"]
["長野朝鮮初中級学校","H220320200025","20(長野)"]
["信濃クッキングスクール","H220320200034","20(長野)"]
["暁商業総合学園","H220320200043","20(長野)"]
["信州予備学校","H220320200052","20(長野)"]
["上田予備学校","H220320300015","20(長野)"]
["岡谷市医師会附属准看護学院","H220320400014","20(長野)"]
["上條珠算簿記学園","H220320400023","20(長野)"]
["諏訪市医師会附属准看護学院","H220320600012","20(長野)"]
["慶英学院高等予備校","H220320600021","20(長野)"]
["上伊那医師会附属准看護学院","H220320900019","20(長野)"]
["信州外語学院","H220320900028","20(長野)"]
["笠原学園","H220321500011","20(長野)"]
["臼田経理学校","H220321700019","20(長野)"]
["佐久料理服装学院","H220321700028","20(長野)"]
["日進学園","H220336100013","20(長野)"]
["いぬい洋裁学院","H221320100016","21(岐阜)"]
["岐阜編物専門学院","H221320100025","21(岐阜)"]
["河合塾岐阜校","H221320100034","21(岐阜)"]
["岐阜朝鮮初・中級学校","H221320100043","21(岐阜)"]
["岐阜市医師会准看護学校","H221320100052","21(岐阜)"]
["加納高等珠算簿記学校","H221320100061","21(岐阜)"]
["三田洞自動車学校","H221320100070","21(岐阜)"]
["中日喫茶調理学院岐阜校","H221320100089","21(岐阜)"]
["ホツマインターナショナルスクール","H221320100098","21(岐阜)"]
["大垣ドレスメーカー女学院","H221320200015","21(岐阜)"]
["ＨＩＲＯ学園エスコーラブラジレイラプロフェソールカワセ","H221320200024","21(岐阜)"]
["大垣市医師会准看護学校","H221320200033","21(岐阜)"]
["大石高等速算学校","H221320200042","21(岐阜)"]
["スバル学院大垣校","H221320200051","21(岐阜)"]
["ＢｅＳｃｈｏｏｌ","H221320300014","21(岐阜)"]
["高山自動車学校","H221320300023","21(岐阜)"]
["多治見市医師会准看護学校","H221320400013","21(岐阜)"]
["大原自動車学校","H221320400022","21(岐阜)"]
["多治見自動車学校","H221320400031","21(岐阜)"]
["羽島市医師会准看護学校","H221320900018","21(岐阜)"]
["大喜スタディ・スクール","H221320900027","21(岐阜)"]
["イザキニュートン学校","H221321100014","21(岐阜)"]
["土岐医師会准看護学校","H221321200013","21(岐阜)"]
["中部速算学校","H221321200022","21(岐阜)"]
["各務原市医師会准看護学校","H221321300012","21(岐阜)"]
["那加自動車学校","H221321300021","21(岐阜)"]
["可茂准看護学校","H221321400011","21(岐阜)"]
["スバル学院本巣校","H221321800017","21(岐阜)"]
["郡上高等珠算学校","H221321900016","21(岐阜)"]
["西濃自動車学校","H221322100012","21(岐阜)"]
["関谷そろばん学校","H221330300013","21(岐阜)"]
["立木珠算学校","H221340300012","21(岐阜)"]
["立木書写書道学校","H221340300021","21(岐阜)"]
["三島ドレスメーカー女学院","H222310000017","22(静岡)"]
["沼津日本語学院","H222310000026","22(静岡)"]
["渡辺ニッテイングスクール","H222310000044","22(静岡)"]
["エスコーラフジ","H222310000053","22(静岡)"]
["富士山日本語学校","H222310000062","22(静岡)"]
["稲取珠算学校","H222310000071","22(静岡)"]
["松崎珠算学校","H222310000080","22(静岡)"]
["静岡朝鮮初中級学校","H222310000099","22(静岡)"]
["静岡珠算学校","H222310000106","22(静岡)"]
["南條珠算学校","H222310000115","22(静岡)"]
["川口栄養料理学校","H222310000124","22(静岡)"]
["興津珠算学校","H222310000133","22(静岡)"]
["伊藤珠算学校","H222310000142","22(静岡)"]
["カワイ音楽学園","H222310000151","22(静岡)"]
["浜松ブラザー編物学院","H222310000160","22(静岡)"]
["助信珠算学校","H222310000179","22(静岡)"]
["遠州速算学校","H222310000188","22(静岡)"]
["ムンド・デ・アレグリア学校","H222310000197","22(静岡)"]
["伯人学校イーエーエス浜松","H222310000204","22(静岡)"]
["浜松日本語学院","H222310000213","22(静岡)"]
["山梨珠算学校","H222310000222","22(静岡)"]
["静岡国際言語学院","H222310000231","22(静岡)"]
["気賀珠算学校","H222310000240","22(静岡)"]
["国際ことば学院日本語学校","H222310000259","22(静岡)"]
["静岡日本語教育センター","H222310000268","22(静岡)"]
["河合塾千種校","H223310000016","23(愛知)"]
["曹洞宗高等尼学林","H223310000025","23(愛知)"]
["石川速算実務学校","H223310000034","23(愛知)"]
["あいち自動車学校","H223310000043","23(愛知)"]
["深田高等速算学校","H223310000052","23(愛知)"]
["山田珠算専修学園","H223310000061","23(愛知)"]
["河合塾名駅校","H223310000070","23(愛知)"]
["名古屋朝鮮初級学校","H223310000089","23(愛知)"]
["名古屋韓国学校","H223310000114","23(愛知)"]
["中部日本自動車学校","H223310000123","23(愛知)"]
["笠寺高等珠算学校","H223310000132","23(愛知)"]
["道徳高等珠算学校","H223310000141","23(愛知)"]
["名古屋国際学校","H223310000150","23(愛知)"]
["守山高等珠算学校","H223310000169","23(愛知)"]
["瀬古高等珠算学校","H223310000178","23(愛知)"]
["名鉄自動車学校","H223310000187","23(愛知)"]
["豊橋中部珠算学校","H223310000196","23(愛知)"]
["大滝珠算学校","H223310000203","23(愛知)"]
["山本珠算学校","H223310000212","23(愛知)"]
["豊橋朝鮮初級学校","H223310000221","23(愛知)"]
["岡崎自動車学校","H223310000230","23(愛知)"]
["岡崎北部高等珠算学校","H223310000249","23(愛知)"]
["愛知県一宮自動車学校","H223310000258","23(愛知)"]
["一宮中央高等珠算学校","H223310000267","23(愛知)"]
["矢野ドレスメーカー女学院","H223310000276","23(愛知)"]
["萩原高等珠算学校","H223310000285","23(愛知)"]
["愛知朝鮮第七初級学校","H223310000301","23(愛知)"]
["東春朝鮮初級学校","H223310000310","23(愛知)"]
["豊川珠算実務学校","H223310000329","23(愛知)"]
["津島高等珠算学校","H223310000338","23(愛知)"]
["宮川高等珠算学校","H223310000347","23(愛知)"]
["富士松高等珠算学校","H223310000356","23(愛知)"]
["挙母高等珠算学校","H223310000365","23(愛知)"]
["田中高等珠算学校","H223310000374","23(愛知)"]
["安城高等珠算学校","H223310000383","23(愛知)"]
["蒲郡文化服装学院","H223310000392","23(愛知)"]
["平洲高等珠算学校","H223310000418","23(愛知)"]
["愛知実務珠算学校","H223310000427","23(愛知)"]
["三条高等珠算学校","H223310000436","23(愛知)"]
["愛知朝鮮中高級学校","H223310000454","23(愛知)"]
["愛知朝鮮第九初級学校","H223310000463","23(愛知)"]
["東元珠算学校","H223310000472","23(愛知)"]
["平和高等速算学校","H223310000481","23(愛知)"]
["大治高等速算学校","H223310000490","23(愛知)"]
["勝幡高等速算学校","H223310000506","23(愛知)"]
["光松珠算学校","H223310000515","23(愛知)"]
["河合塾豊橋校","H223310000524","23(愛知)"]
["駿台予備学校名古屋校","H223310000533","23(愛知)"]
["東海美容学校","H223310000542","23(愛知)"]
["名古屋ＹＷＣＡ学院日本語学校","H223310000551","23(愛知)"]
["ドルトンスクール名古屋","H223310000560","23(愛知)"]
["カンティーニョ","H223310000579","23(愛知)"]
["伯人学校イーエーエス豊橋","H223310000588","23(愛知)"]
["伯人学校イーエーエス豊田","H223310000597","23(愛知)"]
["伯人学校イーエーエス碧南","H223310000604","23(愛知)"]
["ＹＡＭＡＳＡ言語文化学院","H223310000613","23(愛知)"]
["愛知工科大学外国語学校","H223310000622","23(愛知)"]
["名古屋ＡＩＵＥＯ国際学園","H223310000631","23(愛知)"]
["江西インターナショナルスクール","H223310000640","23(愛知)"]
["岡崎日本語学校","H223310000659","23(愛知)"]
["各種学校アセアン日本語学校","H223310000668","23(愛知)"]
["ＡＳＡＨＩ文化学院","H223310000677","23(愛知)"]
["久居珠算簿記学校","H224320195019","24(三重)"]
["津珠算簿記学校","H224320195028","24(三重)"]
["椋本珠算学校","H224320195037","24(三重)"]
["津橋南珠算学校","H224320195046","24(三重)"]
["三重日本語学校","H224320195055","24(三重)"]
["共興高等商業学校","H224320295018","24(三重)"]
["日野珠算学校","H224320295027","24(三重)"]
["富田珠算学園","H224320295036","24(三重)"]
["泰翠学園","H224320295054","24(三重)"]
["四日市朝鮮初中級学校","H224320295063","24(三重)"]
["ニッケン学園","H224320295081","24(三重)"]
["小俣珠算実務学校","H224320395017","24(三重)"]
["伊勢地区医師会准看護学校","H224320395026","24(三重)"]
["パリス文化服装学院","H224320495016","24(三重)"]
["向陽台総合学院","H224320495025","24(三重)"]
["聖心珠算学園","H224320595015","24(三重)"]
["長島珠算学園","H224320595024","24(三重)"]
["ＮＤＣ技芸教育連盟","H224320795013","24(三重)"]
["三鈴実務珠算學校","H224320795022","24(三重)"]
["神戸速算学校","H224320795031","24(三重)"]
["伯人学校イーエーエス鈴鹿","H224320795040","24(三重)"]
["錦花技藝女学校","H224320895012","24(三重)"]
["すみれ文化服装学院","H224320895021","24(三重)"]
["竹島珠算簿記学校","H224320895030","24(三重)"]
["昇英塾名張本校","H224320895049","24(三重)"]
["昇英塾つつじが丘校","H224320895058","24(三重)"]
["昇英塾桔梗が丘校","H224320895067","24(三重)"]
["昇英塾梅が丘校","H224320895076","24(三重)"]
["昇英塾百合が丘校","H224320895085","24(三重)"]
["浜島珠算学校","H224321595013","24(三重)"]
["関西珠算学院","H224321595022","24(三重)"]
["昇英塾桐ヶ丘校","H224321695012","24(三重)"]
["昇英塾伊賀上野城下町校","H224321695021","24(三重)"]
["朝日珠算学園","H224334395018","24(三重)"]
["倉田計理学校","H224347295011","24(三重)"]
["滋賀ビジネス学院","H225320100012","25(滋賀)"]
["滋賀朝鮮初中級学校","H225320100021","25(滋賀)"]
["日本フィンランド学校","H225320100030","25(滋賀)"]
["彦根自動車学校","H225320200011","25(滋賀)"]
["飯田洋裁学園","H225320300010","25(滋賀)"]
["長浜自動車学校","H225320300029","25(滋賀)"]
["日本華香和裁学園","H225321300018","25(滋賀)"]
["日本ラチーノ学院","H225321300027","25(滋賀)"]
["愛知川ドレスメーカー学院","H225342500012","25(滋賀)"]
["豊郷病院附属准看護学院","H225344100012","25(滋賀)"]
["ひかり英語学園","H226310000013","26(京都)"]
["シオツ洋裁学院","H226310000022","26(京都)"]
["富士学園","H226310000031","26(京都)"]
["塚本自動車学校","H226310000040","26(京都)"]
["京都国学院","H226310000059","26(京都)"]
["本門法華宗学院","H226310000068","26(京都)"]
["近畿予備校","H226310000077","26(京都)"]
["京都女子文化服装学院","H226310000086","26(京都)"]
["平安予備校","H226310000095","26(京都)"]
["大谷専修学院","H226310000102","26(京都)"]
["京都朝鮮中高級学校","H226310000111","26(京都)"]
["清和学園","H226310000120","26(京都)"]
["ＫＦＳファッションスクール","H226310000139","26(京都)"]
["鴨川学園","H226310000148","26(京都)"]
["関西音楽学校","H226310000157","26(京都)"]
["五条洋裁女学院","H226310000166","26(京都)"]
["祇園女子技芸学校","H226310000175","26(京都)"]
["都華道文化学院","H226310000184","26(京都)"]
["智山専修学院","H226310000193","26(京都)"]
["ルンビニ服装学園","H226310000200","26(京都)"]
["実業研修学院","H226310000219","26(京都)"]
["京都労働学校","H226310000228","26(京都)"]
["京都洋裁学院","H226310000237","26(京都)"]
["京都信明学校","H226310000246","26(京都)"]
["浄土真宗本願寺派中央佛教学院","H226310000255","26(京都)"]
["安本音楽学園","H226310000264","26(京都)"]
["京都府自動車学校","H226310000273","26(京都)"]
["醍醐山傳法学院","H226310000282","26(京都)"]
["長宗我部はま子バレエ学園","H226310000291","26(京都)"]
["東山女子技芸学校","H226310000308","26(京都)"]
["京都朝鮮第二初級学校","H226310000317","26(京都)"]
["京都朝鮮初級学校","H226310000326","26(京都)"]
["研学キャンパス","H226310000335","26(京都)"]
["進ゼミ京都","H226310000344","26(京都)"]
["河合塾京都校","H226310000353","26(京都)"]
["駿台予備学校京都南校","H226310000362","26(京都)"]
["京都府福知山自動車学校","H226310000371","26(京都)"]
["舞鶴家政専門学校","H226310000380","26(京都)"]
["京都府舞鶴自動車学校","H226310000399","26(京都)"]
["綾部経理学院","H226310000406","26(京都)"]
["綾部自動車学校","H226310000415","26(京都)"]
["京都立体デザインスクール","H226310000424","26(京都)"]
["加茂速算学校","H226310000433","26(京都)"]
["加悦大和女学院","H226310000442","26(京都)"]
["園部安全自動車学校","H226310000451","26(京都)"]
["京都インターナショナルユニバーシティー","H226310000460","26(京都)"]
["京都文化日本語学校","H226310000479","26(京都)"]
["関西語言学院","H226310000488","26(京都)"]
["ＫｙｏｔｏＩｎｔｅｒｎａｔｉｏｎａｌＳｃｈｏｏｌ","H226310000497","26(京都)"]
["同志社国際学院国際部","H226310000503","26(京都)"]
["ＡＲＣ京都日本語学校","H226310000512","26(京都)"]
["瓶井学園日本語学校京都校","H226310000521","26(京都)"]
["ＹＩＣ京都日本語学院","H226310000530","26(京都)"]
["独立行政法人日本学生支援機構大阪日本語教育センター","H227310000012","27(大阪)"]
["大阪文化国際学校","H227310000021","27(大阪)"]
["大阪ＹＭＣＡインターナショナルスクール","H227310000030","27(大阪)"]
["駿台予備学校上本町校","H227310000049","27(大阪)"]
["駿台予備学校大阪南校","H227310000058","27(大阪)"]
["関西ドレスメーカー学院","H227310000067","27(大阪)"]
["聖バルナバ助産師学院","H227310000076","27(大阪)"]
["河合塾上本町校","H227310000085","27(大阪)"]
["河合塾天王寺校","H227310000094","27(大阪)"]
["大阪ＹＭＣＡ学院","H227310000101","27(大阪)"]
["大阪中華学校","H227310000110","27(大阪)"]
["メリック日本語学校","H227310000129","27(大阪)"]
["河合塾大阪校","H227310000147","27(大阪)"]
["大阪福島朝鮮初級学校","H227310000156","27(大阪)"]
["北大阪朝鮮初・中級学校","H227310000165","27(大阪)"]
["新大阪外国語学院","H227310000174","27(大阪)"]
["中大阪朝鮮初・中級学校","H227310000183","27(大阪)"]
["生野朝鮮初級学校","H227310000209","27(大阪)"]
["大阪朝鮮第四初級学校","H227310000218","27(大阪)"]
["城北朝鮮初級学校","H227310000227","27(大阪)"]
["関西調理師学校","H227310000236","27(大阪)"]
["南大阪朝鮮初級学校","H227310000254","27(大阪)"]
["東洋珠算学校","H227310000263","27(大阪)"]
["森ノ宮医療学園ウェルランゲージスクール","H227310000272","27(大阪)"]
["井村珠算学校","H227310000281","27(大阪)"]
["駿台予備学校大阪校","H227310000307","27(大阪)"]
["行信教校","H227310000316","27(大阪)"]
["コリア国際学園中等部高等部","H227310000325","27(大阪)"]
["近鉄自動車学校","H227310000334","27(大阪)"]
["東大阪朝鮮初級学校","H227310000352","27(大阪)"]
["大阪朝鮮中高級学校","H227310000361","27(大阪)"]
["上田珠算学校","H227310000370","27(大阪)"]
["東大阪准看護学院","H227310000398","27(大阪)"]
["関西学院大阪インターナショナルスクール","H227310000405","27(大阪)"]
["ポプラ介護福祉学校","H227310000414","27(大阪)"]
["大学予備校芦屋学院","H228310000011","28(兵庫)"]
["甲南高等文化学院","H228310000020","28(兵庫)"]
["神戸ドイツ学院インターナショナル","H228310000039","28(兵庫)"]
["神戸文化服装学院","H228310000048","28(兵庫)"]
["学校法人カネディアン・アカデミイ","H228310000057","28(兵庫)"]
["神戸朝鮮初中級学校","H228310000066","28(兵庫)"]
["駿台予備学校神戸校","H228310000075","28(兵庫)"]
["河合塾神戸三宮校","H228310000084","28(兵庫)"]
["布引珠算学院","H228310000093","28(兵庫)"]
["東川崎珠算専修学院","H228310000100","28(兵庫)"]
["神戸タイピスト専門学院","H228310000119","28(兵庫)"]
["日本タイピスト学校","H228310000128","28(兵庫)"]
["神戸ＹＭＣＡ高等学院","H228310000137","28(兵庫)"]
["神戸中華同文学校","H228310000146","28(兵庫)"]
["学校法人聖ミカエル国際学校","H228310000155","28(兵庫)"]
["学校法人神戸セミナー","H228310000164","28(兵庫)"]
["兵庫韓国学園","H228310000173","28(兵庫)"]
["神戸湊川珠算専修学院","H228310000182","28(兵庫)"]
["神戸親交珠算学院","H228310000191","28(兵庫)"]
["兵庫珠算学院","H228310000208","28(兵庫)"]
["本田珠算専修学院","H228310000217","28(兵庫)"]
["西神戸朝鮮初中級学校","H228310000226","28(兵庫)"]
["神戸韓国学園","H228310000235","28(兵庫)"]
["神戸常盤珠算学院","H228310000244","28(兵庫)"]
["西須磨珠算学院","H228310000253","28(兵庫)"]
["グレスホーム洋裁学院","H228310000262","28(兵庫)"]
["マリストブラザーズインターナショナルスクール","H228310000271","28(兵庫)"]
["関西聖書神学校","H228310000280","28(兵庫)"]
["神戸朝鮮高級学校","H228310000299","28(兵庫)"]
["予備校創学ゼミナール","H228310000306","28(兵庫)"]
["編物友の会女学院","H228310000315","28(兵庫)"]
["兵庫県自動車学校姫路校","H228310000324","28(兵庫)"]
["西播朝鮮初中級学校","H228310000333","28(兵庫)"]
["姫路予備校","H228310000342","28(兵庫)"]
["島之内洋裁学院","H228310000351","28(兵庫)"]
["尼崎珠算専攻学院","H228310000360","28(兵庫)"]
["難波珠算学院","H228310000379","28(兵庫)"]
["琴城珠算学院","H228310000388","28(兵庫)"]
["立石珠算学院","H228310000397","28(兵庫)"]
["伊藤衣服研究所","H228310000404","28(兵庫)"]
["パロマ服装女学院","H228310000413","28(兵庫)"]
["高岡編物学院","H228310000422","28(兵庫)"]
["尼崎朝鮮初中級学校","H228310000431","28(兵庫)"]
["尼崎韓国学園","H228310000440","28(兵庫)"]
["尼崎文化服装学院","H228310000459","28(兵庫)"]
["兵庫県自動車学校明石校","H228310000468","28(兵庫)"]
["西藤珠算学院二見教場","H228310000477","28(兵庫)"]
["甲子園ドレスメーカー女学院","H228310000486","28(兵庫)"]
["西宮蛍光珠算学院","H228310000495","28(兵庫)"]
["兵庫県自動車学校西宮本校","H228310000501","28(兵庫)"]
["江川バレエスクール","H228310000510","28(兵庫)"]
["立聖館学院","H228310000529","28(兵庫)"]
["甲陽ドレスメーカー女学院","H228310000538","28(兵庫)"]
["山口学園芦屋デザイナースクール","H228310000547","28(兵庫)"]
["芦屋インターナショナルスクール","H228310000556","28(兵庫)"]
["伊丹朝鮮初級学校","H228310000565","28(兵庫)"]
["大学予備校浜ゼミナール","H228310000574","28(兵庫)"]
["吉田綜合技芸学院","H228310000583","28(兵庫)"]
["書窓学院","H228310000592","28(兵庫)"]
["加古川ファッションカレッジ","H228310000609","28(兵庫)"]
["加古川文化女学院","H228310000618","28(兵庫)"]
["赤穂洋裁女学院","H228310000636","28(兵庫)"]
["鍋谷鈴子デザインルーム","H228310000645","28(兵庫)"]
["西脇珠算簿記学院","H228310000654","28(兵庫)"]
["宝塚音楽学校","H228310000663","28(兵庫)"]
["宝塚学院書道美術学校","H228310000672","28(兵庫)"]
["三木文化服装学園","H228310000681","28(兵庫)"]
["すずらん洋裁学院","H228310000690","28(兵庫)"]
["山城技芸学院","H228310000707","28(兵庫)"]
["稲美服装女学院","H228310000716","28(兵庫)"]
["山崎ドレス女学院","H228310000725","28(兵庫)"]
["茜洋裁学院","H228310000734","28(兵庫)"]
["郡家ドレスメーカー女学院","H228310000743","28(兵庫)"]
["篠山学園","H228310000752","28(兵庫)"]
["奈良朝鮮初中級学校","H229310000029","29(奈良)"]
["高田経理学校","H229310000038","29(奈良)"]
["高田ビジネスコンピュータ学校","H229310000047","29(奈良)"]
["天理教校","H229310000056","29(奈良)"]
["天理教語学院","H229310000065","29(奈良)"]
["マーキュリー洋裁学院","H229310000074","29(奈良)"]
["奈良自動車学校","H229310000083","29(奈良)"]
["奈良珠算学校","H229310000092","29(奈良)"]
["春日自動車学校","H229310000109","29(奈良)"]
["高田書芸学校","H229310000118","29(奈良)"]
["吉田珠算学校","H229310000136","29(奈良)"]
["橿原女学院","H229310000145","29(奈良)"]
["大成珠算学校","H229310000154","29(奈良)"]
["御所珠算学校","H229310000172","29(奈良)"]
["川西珠算学校","H229310000181","29(奈良)"]
["伴堂珠算学校","H229310000190","29(奈良)"]
["香芝自動車学校","H229310000225","29(奈良)"]
["王寺珠算学校","H229310000234","29(奈良)"]
["五条珠算簿記学校","H229310000252","29(奈良)"]
["葛城自動車学校","H229310000261","29(奈良)"]
["龍田珠算学校","H229310000270","29(奈良)"]
["王寺自動車学校","H229310000289","29(奈良)"]
["大和国際日本語学院","H229310000298","29(奈良)"]
["大和まほろば日本語学校","H229310000305","29(奈良)"]
["ＨＡＹＡＭＡＩｎｔｅｒｎａｔｉｏｎａｌＬａｎｇｕａｇｅＳｃｈｏｏｌ","H229310000314","29(奈良)"]
["奈良介護福祉中央学院","H229310000323","29(奈良)"]
["アスカ国際学院","H229310000332","29(奈良)"]
["奈良ひびき福祉専門学院","H229310000341","29(奈良)"]
["和歌山東部珠算学校","H230310000026","30(和歌山)"]
["高垣計算実務学校","H230310000035","30(和歌山)"]
["藤井計算実務学校","H230310000044","30(和歌山)"]
["和歌山県自動車学校","H230310000053","30(和歌山)"]
["塩屋自動車学校","H230310000062","30(和歌山)"]
["和歌山朝鮮初中級学校","H230310000080","30(和歌山)"]
["国際アークビジネス学校","H230310000106","30(和歌山)"]
["いわき料理学院","H230310000115","30(和歌山)"]
["関西洋裁学校","H230310000124","30(和歌山)"]
["山本珠算学校","H230310000133","30(和歌山)"]
["堺計算実務学校","H230310000142","30(和歌山)"]
["山本計算実務学校","H230310000151","30(和歌山)"]
["田辺料理学校","H230310000160","30(和歌山)"]
["和歌山県田辺自動車学校","H230310000179","30(和歌山)"]
["新宮市医師会准看護学院","H230310000188","30(和歌山)"]
["新宮料理学院","H230310000204","30(和歌山)"]
["萩原きもの総合学院","H230310000213","30(和歌山)"]
["川端計算実務学校","H230310000222","30(和歌山)"]
["南部珠算学校","H230310000240","30(和歌山)"]
["みなべ自動車学校","H230310000259","30(和歌山)"]
["叶計算実務学校","H230310000268","30(和歌山)"]
["栗栖珠算学校","H230310000277","30(和歌山)"]
["米川計算実務学校","H230310000286","30(和歌山)"]
["太地高等珠算学校","H230310000295","30(和歌山)"]
["イナバ自動車学校","H231310000016","31(鳥取)"]
["鳥取県東部自動車学校","H231310000025","31(鳥取)"]
["日本海自動車学校","H231310000034","31(鳥取)"]
["山陰中央自動車学校","H231310000043","31(鳥取)"]
["米子西部自動車学校","H231310000052","31(鳥取)"]
["米子自動車学校","H231310000061","31(鳥取)"]
["鳥取県自動車学校","H231310000070","31(鳥取)"]
["鳥取県中央自動車学校","H231310000089","31(鳥取)"]
["鳥取県倉吉自動車学校","H231310000098","31(鳥取)"]
["倉吉予備校","H231310000105","31(鳥取)"]
["米子予備校","H231310000114","31(鳥取)"]
["中央予備校","H231310000123","31(鳥取)"]
["伯耆駿英予備校","H231310000132","31(鳥取)"]
["米子国際ビジネスカレッジ","H231310000141","31(鳥取)"]
["倉吉鴨水館","H231310000150","31(鳥取)"]
["鳥取城北日本語学校","H231310000169","31(鳥取)"]
["坪内珠算学校出雲郷校","H232312345676","32(島根)"]
["松江予備校","H232320100022","32(島根)"]
["坪内珠算学校","H232320100031","32(島根)"]
["坪内珠算学校古志原校","H232320100040","32(島根)"]
["坪内珠算学校乃木校","H232320100059","32(島根)"]
["坪内珠算学校津田校","H232320100068","32(島根)"]
["坪内珠算学校中央校","H232320100077","32(島根)"]
["坪内珠算学校川津校","H232320100086","32(島根)"]
["坪内珠算学校内中原校","H232320100095","32(島根)"]
["坪内珠算学校比津校","H232320100111","32(島根)"]
["いとや服飾学院","H232320100264","32(島根)"]
["浜田准看護学校","H232320200236","32(島根)"]
["清明理容学校","H232320200254","32(島根)"]
["出雲自動車学校","H232320300011","32(島根)"]
["坪内珠算学校神西校","H232320300128","32(島根)"]
["坪内珠算学校神戸川校","H232320300137","32(島根)"]
["坪内珠算学校四絡校","H232320300146","32(島根)"]
["坪内珠算学校塩冶校","H232320300155","32(島根)"]
["坪内珠算学校北陽校","H232320300164","32(島根)"]
["坪内珠算学校西野校","H232320300173","32(島根)"]
["坪内珠算学校大東校","H232320900186","32(島根)"]
["坪内珠算学校加茂校","H232320900195","32(島根)"]
["坪内珠算学校福生校","H232399900206","32(島根)"]
["坪内珠算学校義方校","H232399900215","32(島根)"]
["坪内珠算学校住吉校","H232399900224","32(島根)"]
["岡山進研学院","H233310000014","33(岡山)"]
["岡山自動車学校","H233310000023","33(岡山)"]
["英数学館岡山校","H233310000032","33(岡山)"]
["岡山健康学院","H233310000041","33(岡山)"]
["旭川荘療育アカデミー","H233310000050","33(岡山)"]
["沼自動車学校","H233310000069","33(岡山)"]
["倉敷自動車学校","H233310000078","33(岡山)"]
["岡山朝鮮初中級学校","H233310000087","33(岡山)"]
["菅公学生服家政学園","H233310000096","33(岡山)"]
["玉野ドレスメーカー女学院","H233310000103","33(岡山)"]
["笠岡自動車学校","H233310000121","33(岡山)"]
["岡山外語学院","H233310000130","33(岡山)"]
["金光教学院","H233310000149","33(岡山)"]
["ＫＵＲＡＦＵＫＵキャリアカレッジ","H233310000158","33(岡山)"]
["広島ＹＭＣＡ学園","H234310000013","34(広島)"]
["広島インターナショナルスクール","H234310000022","34(広島)"]
["安佐准看護学院","H234310000031","34(広島)"]
["ひろしま美術研究所","H234310000059","34(広島)"]
["西広島福祉学院大塚校","H234310000068","34(広島)"]
["アドウィンテクノ塾","H234310000077","34(広島)"]
["河合塾広島校","H234310000086","34(広島)"]
["エンゼルペットアカデミー","H234310000095","34(広島)"]
["駿台予備学校広島校","H234310000102","34(広島)"]
["三原国際外語学院","H234310000111","34(広島)"]
["尾道准看護学院","H234310000120","34(広島)"]
["福山グルーミング技術学校","H234310000148","34(広島)"]
["福山ペットビジネス専門学院","H234310000166","34(広島)"]
["広島アカデミー","H234310000175","34(広島)"]
["府中地区医師会准看護学院","H234310000184","34(広島)"]
["広島朝鮮初中高級学校","H234310000200","34(広島)"]
["弥勒の里国際文化学院日本語学校","H234310000219","34(広島)"]
["東洋整体学院","H234310000228","34(広島)"]
["天心高等洋裁学園","H234310000237","34(広島)"]
["ＫＳ国際学院","H234310000246","34(広島)"]
["ＡＩＣ国際学院広島初等部","H234310000255","34(広島)"]
["山口県下関自動車学校","H235310000012","35(山口)"]
["山陽自動車学校","H235310000021","35(山口)"]
["下関西南ドレスメーカー女学院","H235310000030","35(山口)"]
["山口朝鮮初中級学校","H235310000049","35(山口)"]
["早鞆自動車学校","H235310000058","35(山口)"]
["下関文化服装学院","H235310000067","35(山口)"]
["宇部中央自動車学校","H235310000076","35(山口)"]
["山口県宇部自動車学校","H235310000094","35(山口)"]
["西日本自動車学校","H235310000101","35(山口)"]
["宇部文化洋裁学院","H235310000110","35(山口)"]
["山口県湯田自動車学校","H235310000138","35(山口)"]
["山口そうごう自動車学校","H235310000147","35(山口)"]
["山口県萩自動車学校","H235310000156","35(山口)"]
["萩准看護学院","H235310000165","35(山口)"]
["山口県周南自動車学校","H235310000174","35(山口)"]
["中尾文化服装学院","H235310000183","35(山口)"]
["山口県高等自動車学校","H235310000192","35(山口)"]
["周南和裁服装学院","H235310000209","35(山口)"]
["岩国自動車学校","H235310000218","35(山口)"]
["岩国国際タイピスト学院","H235310000227","35(山口)"]
["尾野本洋裁専門学院","H235310000236","35(山口)"]
["山口県光自動車学校","H235310000245","35(山口)"]
["山口県柳井自動車学校","H235310000254","35(山口)"]
["柳井医師会附属柳井准看護学院","H235310000263","35(山口)"]
["窪田和裁專門学院","H235310000272","35(山口)"]
["長門自動車学校","H235310000281","35(山口)"]
["大島自動車学校","H235310000290","35(山口)"]
["高森文化服装学院","H235310000307","35(山口)"]
["山口県玖西自動車学校","H235310000316","35(山口)"]
["山口県小郡自動車学校","H235310000325","35(山口)"]
["吉南准看護学院","H235310000334","35(山口)"]
["山口公務員学校","H235310000343","35(山口)"]
["山口県厚狭自動車学校","H235310000352","35(山口)"]
["アイルモータースクール下関","H235310000370","35(山口)"]
["西日本和裁学院","H235310000389","35(山口)"]
["下関明倫学園","H235310000398","35(山口)"]
["高千穂ドレスメーカー女学院","H235310000405","35(山口)"]
["防府公務員学校","H235310000414","35(山口)"]
["津田珠算学校","H236320100019","36(徳島)"]
["尾上和裁学園","H236320100028","36(徳島)"]
["南海病院付属准看護学院","H236320200018","36(徳島)"]
["三好市医師会准看護学院","H236320800012","36(徳島)"]
["島田芸術舞踊学校","H237320100018","37(香川)"]
["久保料理学院","H237320100027","37(香川)"]
["香川編物学院","H237320100036","37(香川)"]
["関西手芸学園","H237320200017","37(香川)"]
["丸亀ニュースタイル編物学院","H237320200035","37(香川)"]
["一般社団法人丸亀市医師会附属准看護学院","H237320200044","37(香川)"]
["濱谷編物学校","H237320200053","37(香川)"]
["マミニットデザインスクール","H237320200062","37(香川)"]
["一般社団法人坂出市医師会附属准看護学院","H237320300016","37(香川)"]
["一般社団法人大川地区医師会附属准看護学院","H237320600013","37(香川)"]
["一般社団法人三豊・観音寺市医師会立三豊准看護学院","H237320800011","37(香川)"]
["米倉洋裁学苑","H237332200012","37(香川)"]
["一般社団法人小豆郡医師会立小豆島准看護学院","H237332400010","37(香川)"]
["一般社団法人木田地区医師会附属准看護学院","H237334100019","37(香川)"]
["東進衛星予備校","H238320100017","38(愛媛)"]
["四国朝鮮初中級学校","H238320100026","38(愛媛)"]
["愛媛高等予備学校","H238320100035","38(愛媛)"]
["宇和島美容学校","H238320300015","38(愛媛)"]
["宇和島自動車学校","H238320300024","38(愛媛)"]
["はぴねす外語学院","H238320500013","38(愛媛)"]
["鈴木水引手芸学校","H238321300013","38(愛媛)"]
["四国中央自動車学校","H238321300022","38(愛媛)"]
["双葉ドレスメーカー女学院","H238321300031","38(愛媛)"]
["学校法人スター洋裁学園","H238350600019","38(愛媛)"]
["フヂ服飾デザインスクール","H239310000018","39(高知)"]
["高知芸術学園","H239310000027","39(高知)"]
["土佐塾予備校","H239310000036","39(高知)"]
["ＴＣＣ高等学院","H239310000045","39(高知)"]
["城東簿記珠算学校","H239310000063","39(高知)"]
["清和准看護学院","H239310000072","39(高知)"]
["うきは市立自動車学校","H240222500017","40(福岡)"]
["北九州予備校小倉校","H240310000015","40(福岡)"]
["北九州ＹＭＣＡ学院","H240310000024","40(福岡)"]
["九州朝鮮中高級学校","H240310000033","40(福岡)"]
["北九州朝鮮初級学校","H240310000042","40(福岡)"]
["日本語学学校","H240310000051","40(福岡)"]
["福岡朝鮮初級学校","H240313000019","40(福岡)"]
["愛和外語学院","H240313000028","40(福岡)"]
["美術研究所村上画塾","H240313000037","40(福岡)"]
["田中重子製帽専門学院","H240313000046","40(福岡)"]
["九州英数学館国際言語学院","H240313000055","40(福岡)"]
["西日本国際教育学院","H240313000064","40(福岡)"]
["福岡県自動車学校","H240313000073","40(福岡)"]
["福岡ＹＭＣＡ学院","H240313000082","40(福岡)"]
["福岡インターナショナルスクール","H240313000091","40(福岡)"]
["西鉄自動車学校","H240321900013","40(福岡)"]
["宮地嶽神社附属高等女子文華学園","H240322400016","40(福岡)"]
["日本文化語学院","H240323000018","40(福岡)"]
["さくら日本語学院","H240334500010","40(福岡)"]
["日本語学校弘堂国際学園","H241320300029","41(佐賀)"]
["苑田編物和裁学院","H242310000013","42(長崎)"]
["あざみ洋裁学院","H242310000022","42(長崎)"]
["有益語学学院","H242310000031","42(長崎)"]
["長崎野田ゼミナール","H242310000040","42(長崎)"]
["長崎日本語アカデミー","H242310000059","42(長崎)"]
["ＫｏｋｏｒｏＣｏｌｌｅｇｅＪａｐａｎ","H242310000068","42(長崎)"]
["五島日本語学校","H242310000077","42(長崎)"]
["あさひ日本語学校","H242310000086","42(長崎)"]
["精道ホームアーツ・スクール","H242310000095","42(長崎)"]
["九州音楽専門学院","H243310000012","43(熊本)"]
["寺原自動車学校","H243310000021","43(熊本)"]
["人吉球磨准看護学院","H243310000030","43(熊本)"]
["松浦服装学院","H243310000049","43(熊本)"]
["塩渕総合料理学園","H243310000058","43(熊本)"]
["本渡文化服装学院","H243310000067","43(熊本)"]
["大分市立エスペランサコレジオ","H244210000013","44(大分)"]
["国東市立国東自動車学校","H244210000022","44(大分)"]
["大分電波通信専攻学校","H244310000011","44(大分)"]
["大分県自動車学校","H244310000020","44(大分)"]
["堀井洋裁学院","H244310000039","44(大分)"]
["大分自動車学校","H244310000048","44(大分)"]
["日田香蘭高等文化学院","H244310000057","44(大分)"]
["日田自動車学校","H244310000066","44(大分)"]
["佐伯自動車学校","H244310000075","44(大分)"]
["佐伯市医師会立佐伯准看護学院","H244310000084","44(大分)"]
["三重自動車学校","H244310000093","44(大分)"]
["豊後大野市竹田市医師会共立豊西准看護学院","H244310000100","44(大分)"]
["大分スクールオブビジネス","H244310000119","44(大分)"]
["明日香日本語学校","H244310000128","44(大分)"]
["ＩＶＹ大分公務員学院","H244310000137","44(大分)"]
["宮崎栄進学院","H245320192053","45(宮崎)"]
["宮崎中村学園","H245320192151","45(宮崎)"]
["小林准看護学校","H245320592326","45(宮崎)"]
["児湯准看護学校","H245340192408","45(宮崎)"]
["肝付町立高山准看護学校","H246210000011","46(鹿児島)"]
["出水郡医師会准看護学校","H246310000019","46(鹿児島)"]
["三洲高等経理学校","H246310000037","46(鹿児島)"]
["沖縄ドレスメーカー専門学院","H247320100016","47(沖縄)"]
["すみれ服装学院","H247320100025","47(沖縄)"]
["萬田ドレスメーカー専門学院","H247320100034","47(沖縄)"]
["熊谷和・琉裁きもの専門学院","H247320100052","47(沖縄)"]
["開南洋裁学院","H247320100061","47(沖縄)"]
["ニッケンライセンスアカデミー","H247320100070","47(沖縄)"]
["ユーガーグルーミングスクール那覇校","H247320100089","47(沖縄)"]
["日本文化経済学院","H247320100098","47(沖縄)"]
["沖縄写真デザイン工芸学校","H247320100105","47(沖縄)"]
["ステップワールド日本語学院","H247320100114","47(沖縄)"]
["沖縄学院","H247320800019","47(沖縄)"]
["糸満服装学院","H247321000015","47(沖縄)"]
["コザ尚学院","H247321100014","47(沖縄)"]
["宮古すみれ洋裁学院","H247321400011","47(沖縄)"]
["沖縄クリスチャンスクール","H247332400018","47(沖縄)"]
["ＨｏｐｅＩｎｔｅｒｎａｔｉｏｎａｌＡｃａｄｅｍｙ","H247332600016","47(沖縄)"]

{"sheet":"Sheet2","index":3,"n_rows":49,"n_cols":5,"rows_kept":49,"cut":false,"hidden":true,"merged":[]}
[]
[null,"番号","都道府県名",null,"都道府県"]
[null,"01","北海道",null,"01北海道"]
[null,"02","青   森",null,"02青   森"]
[null,"03","岩   手",null,"03岩   手"]
[null,"04","宮   城",null,"04宮   城"]
[null,"05","秋   田",null,"05秋   田"]
[null,"06","山   形",null,"06山   形"]
[null,"07","福   島",null,"07福   島"]
[null,"08","茨   城",null,"08茨   城"]
[null,"09","栃   木",null,"09栃   木"]
[null,"10","群   馬",null,"10群   馬"]
[null,"11","埼   玉",null,"11埼   玉"]
[null,"12","千   葉",null,"12千   葉"]
[null,"13","東   京",null,"13東   京"]
[null,"14","神奈川",null,"14神奈川"]
[null,"15","新   潟",null,"15新   潟"]
[null,"16","富   山",null,"16富   山"]
[null,"17","石   川",null,"17石   川"]
[null,"18","福   井",null,"18福   井"]
[null,"19","山   梨",null,"19山   梨"]
[null,"20","長   野",null,"20長   野"]
[null,"21","岐   阜",null,"21岐   阜"]
[null,"22","静   岡",null,"22静   岡"]
[null,"23","愛   知",null,"23愛   知"]
[null,"24","三   重",null,"24三   重"]
[null,"25","滋   賀",null,"25滋   賀"]
[null,"26","京   都",null,"26京   都"]
[null,"27","大   阪",null,"27大   阪"]
[null,"28","兵   庫",null,"28兵   庫"]
[null,"29","奈   良",null,"29奈   良"]
[null,"30","和歌山",null,"30和歌山"]
[null,"31","鳥   取",null,"31鳥   取"]
[null,"32","島   根",null,"32島   根"]
[null,"33","岡   山",null,"33岡   山"]
[null,"34","広   島",null,"34広   島"]
[null,"35","山   口",null,"35山   口"]
[null,"36","徳   島",null,"36徳   島"]
[null,"37","香   川",null,"37香   川"]
[null,"38","愛   媛",null,"38愛   媛"]
[null,"39","高   知",null,"39高   知"]
[null,"40","福   岡",null,"40福   岡"]
[null,"41","佐   賀",null,"41佐   賀"]
[null,"42","長   崎",null,"42長   崎"]
[null,"43","熊   本",null,"43熊   本"]
[null,"44","大   分",null,"44大   分"]
[null,"45","宮   崎",null,"45宮   崎"]
[null,"46","鹿児島",null,"46鹿児島"]
[null,"47","沖   縄",null,"47沖   縄"]