{"text_format":"1","workbook":"xlsx","n_sheets":4,"sheets":["様式３－２－１（学校基本情報）","様式３－２－6","（回答不要）学校コード","Sheet2"],"not_rendered":{"charts":0,"images":0,"macros":1,"external_links":3,"defined_names":14,"comments":0,"pivot_tables":0},"unopened":[],"bounds":{"document_bytes":16777216,"sheet_cells":100000,"rows_first":2000,"rows_last":500,"rows_between":2000,"halvings":0,"cell_chars":16384,"cell_head_chars":4096},"cells_cut":0,"cells_raw":0,"read":"whole","date_system":"1900"}

{"sheet":"様式３－２－１（学校基本情報）","index":0,"n_rows":25,"n_cols":14,"rows_kept":25,"cut":false,"hidden":false,"merged":[[5,1,6,1],[21,1,21,4],[24,3,26,4],[15,1,15,4],[17,1,17,4],[20,1,20,4],[16,1,16,4],[18,1,18,4],[19,1,19,4]]}
["様式３－２－１",null,null,null,"【各種学校シート】"]
["（学校の基本情報について）",null,null,null,null,null,null,null,null,null,null,null,null,"学校法人"]
[null,null,null,null,null,null,"入力チェック",null,null,null,null,null,null,"私立学校法第64条第4項の法人（いわゆる準学校法人）"]
[null,"都道府県名 1)","03岩   手",null,null,null,{"$f":"IF(C4=\"\",\"エラー\",\"OK\")","v":"OK"},null,null,null,null,null,null,"財団法人立"]
[null,"設置者名 2)",null,null,null,null,{"$f":"IF(C5=\"\",\"エラー\",\"OK\")","v":"エラー"},null,null,null,null,null,null,"社団法人立"]
[null,"設置者の種別 3)",null,null,null,null,{"$f":"IF(C6=\"\",\"エラー\",\"OK\")","v":"エラー"},null,null,null,null,null,null,"株式会社立"]
[null,null,"（その他の法人の場合：　　　　　　　　　　　　　　　　　　　　）",null,null,null,{"$f":"IF(C6=N8,IF(C7=\"（その他の法人の場合：　　　　　　　　　　　　　　　　　　　　　　　　　　　　　　　　　　）\",\"エラー\",\"OK\"),\"OK\")","v":"OK"},null,null,null,null,null,null,"その他の法人立"]
[null,"学校名",null,null,null,null,{"$f":"IF(C8=\"\",\"エラー\",\"OK\")","v":"エラー"},null,null,null,null,null,null,"個人立"]
[null,"学校コード 4)",{"$f":"IFERROR(VLOOKUP(C8,'（回答不要）学校コード'!A3:C1048,2,FALSE),\"\")","v":""},null,null,null,{"$f":"IF(C9=\"\",\"エラー\",\"OK\")","v":"エラー"},null,null,null,null,null,null,"個人立"]
[null,"法人番号 5)",null,null,null,null,"エラー"]
[null,"担当者名 6)",null,null,null,null,"エラー"]
[null,"担当者の直通電話 6)",null,null,null,null,"エラー"]
[null,"担当者のemail 6)",null,null,null,null,"エラー"]
[]
["〔注〕"]
["１）","「都道府県」の欄は、プルダウンリストから選択してください。"]
["２）","いずれかの法人立の場合は法人名を記載してください。個人立の場合は設置者である個人名を記載してください。"]
["３）","「設置者の種別」は、プルダウンリストから選択してください。「その他の法人立」を選択した場合のみ、自由記述欄に法人の種別を具体的に記載してください。"]
["４）","「学校コード」は、学校名により自動転記されますが、されない場合は「（回答不要）学校コード」シート又は以下のホームページを参考に手動での記入をお願いします。半角数字13桁、ハイフン等無しで記載してください。"]
[null,"https://www.mext.go.jp/b_menu/toukei/mext_01087.html"]
["５）","「法人番号」は、以下のホームページで確認できる、13桁の番号です。半角数字13桁、ハイフン等無しで記載してください。"]
[null,"http://www.houjin-bangou.nta.go.jp/"]
["６）","担当者の欄は、事務担当者を記載してください。回答内容について、文部科学省から個別に御連絡させていただくことがあります。"]
[]
[null,null,null,{"$f":"IF(COUNTIF(G4:G13,\"エラー\")=0,\"OK\",\"エラー\")","v":"エラー"}]

{"sheet":"様式３－２－6","index":1,"n_rows":55,"n_cols":21,"rows_kept":55,"cut":false,"hidden":false,"merged":[[35,9,37,10],[40,9,40,13],[47,19,48,19],[15,14,15,15],[15,16,15,17],[32,1,32,11],[33,1,33,11],[31,1,31,11],[14,13,14,17],[27,2,27,11],[25,1,25,11],[24,1,24,11],[30,1,30,11],[15,5,15,6],[29,1,29,11],[26,2,26,11],[28,2,28,11],[14,2,14,6],[10,0,16,1],[15,3,15,4],[3,13,3,14],[3,15,3,16],[3,17,3,18],[7,13,7,14],[8,13,8,14],[3,6,3,7],[7,6,7,7],[8,6,8,7],[3,2,3,3],[3,0,5,1],[3,4,3,5]]}
["様式３－２－６",null,null,null,null,null,null,null,null,null,null,"【各種学校シート】"]
["（各種学校の学校評価・情報公開等について）"]
[null,null,null,null,null,null,null,null,null,null,null,null,null,"未記入チェック"]
["各種学校 2)",null,"自己評価 3)①",null,"学校関係者評価 3)②",null,"第三者評価 3)③",null,null,null,null,null,null,"自己評価 3)①",null,"学校関係者評価 3)②",null,"第三者評価 3)③"]
[null,null,"実施","結果公表","実施","結果公表","実施","結果公表",null,null,null,null,null,"実施","結果公表","実施","結果公表","実施","結果公表"]
[null,null,null,null,null,null,null,null,null,null,null,null,null,{"$f":"IF(C6=\"\",\"エラー\",\"OK\")","v":"エラー"},{"$f":"IF(C6=\"している\",IF(D6=\"\",\"エラー\",\"OK\"),IF(D6=\"している\",\"エラー\",\"OK\"))","v":"OK"},{"$f":"IF(E6=\"\",\"エラー\",\"OK\")","v":"エラー"},{"$f":"IF(E6=\"している\",IF(F6=\"\",\"エラー\",\"OK\"),IF(F6=\"している\",\"エラー\",\"OK\"))","v":"OK"},{"$f":"IF(G6=\"\",\"エラー\",\"OK\")","v":"エラー"},{"$f":"IF(G6=\"している\",IF(H6=\"\",\"エラー\",\"OK\"),IF(H6=\"している\",\"エラー\",\"OK\"))","v":"OK"}]
[null,null,null,null,null,null,"↓「している」の場合 4)"]
[null,null,null,null,null,null,"実施機関名（自由記述）",null,null,null,null,null,null,"実施機関名（自由記述）"]
[null,null,null,null,null,null,null,null,null,null,null,null,null,{"$f":"IF(G6=\"している\",IF(G9=\"\",\"エラー\",\"OK\"),\"OK\")","v":"OK"}]
[]
["各種学校 2)",null,"情報公開 5)",null,null,null,null,null,null,null,null,null,null,"情報公開 5)"]
[null,null,"実施",null,null,null,null,null,null,null,null,null,null,"実施"]
[null,null,null,null,null,null,null,null,null,null,null,null,null,{"$f":"IF(C13=\"\",\"エラー\",\"OK\")","v":"エラー"}]
[null,null,"↓「している」の場合 6)"]
[null,null,"財務情報等7)の公開",null,null,null,null,null,null,null,null,null,null,"財務情報等7)の公開"]
[null,null,"一般公開 8) を行っているか。","以下の方法で公開しているか（複数選択可）。",null,"以下の情報の公開を行っているか（複数選択可）。",null,null,null,null,null,null,null,"一般公開 8) を行っているか。","以下の方法で公開しているか（複数選択可）。",null,"以下の情報の公開を行っているか（複数選択可）。"]
[null,null,null,"設置者若しくは学校のホームページに掲載",null,"財産目録",null,null,null,null,null,null,null,{"$f":"IF($C$13=\"している\",IF(C17=\"\",\"エラー\",\"OK\"),IF(C17=\"している\",\"エラー\",\"OK\"))","v":"OK"},"設置者若しくは学校のホームページに掲載",{"$f":"IF($C$13=\"している\",IF(E17=\"\",\"エラー\",\"OK\"),IF(E17=\"している\",\"エラー\",\"OK\"))","v":"OK"},"財産目録",{"$f":"IF($C$13=\"している\",IF(G17=\"\",\"エラー\",\"OK\"),IF(G17=\"している\",\"エラー\",\"OK\"))","v":"OK"}]
[null,null,null,"広報誌等の刊行物に掲載",null,"貸借対照表",null,null,null,null,null,null,null,null,"広報誌等の刊行物に掲載",{"$f":"IF($C$13=\"している\",IF(E18=\"\",\"エラー\",\"OK\"),IF(E18=\"している\",\"エラー\",\"OK\"))","v":"OK"},"貸借対照表",{"$f":"IF($C$13=\"している\",IF(G18=\"\",\"エラー\",\"OK\"),IF(G18=\"している\",\"エラー\",\"OK\"))","v":"OK"}]
[null,null,null,"学内掲示板等の掲示",null,"収支計算書",null,null,null,null,null,null,null,null,"学内掲示板等の掲示",{"$f":"IF($C$13=\"している\",IF(E19=\"\",\"エラー\",\"OK\"),IF(E19=\"している\",\"エラー\",\"OK\"))","v":"OK"},"収支計算書",{"$f":"IF($C$13=\"している\",IF(G19=\"\",\"エラー\",\"OK\"),IF(G19=\"している\",\"エラー\",\"OK\"))","v":"OK"}]
[null,null,null,"その他",null,"事業報告書",null,null,null,null,null,null,null,null,"その他",{"$f":"IF($C$13=\"している\",IF(E20=\"\",\"エラー\",\"OK\"),IF(E20=\"している\",\"エラー\",\"OK\"))","v":"OK"},"事業報告書",{"$f":"IF($C$13=\"している\",IF(G20=\"\",\"エラー\",\"OK\"),IF(G20=\"している\",\"エラー\",\"OK\"))","v":"OK"}]
[null,null,null,null,null,"監査報告書",null,null,null,null,null,null,null,null,null,null,"監査報告書",{"$f":"IF($C$13=\"している\",IF(G21=\"\",\"エラー\",\"OK\"),IF(G21=\"している\",\"エラー\",\"OK\"))","v":"OK"}]
[]
["〔注〕"]
["１）","黄色に着色されたセルについて「している」又は「していない」等選択肢から該当するものを選択してください。"]
["２）","「自己評価」、「学校関係者評価」、「第三者評価」、「情報公開」の項目は、今年度中に実施または結果公表をした場合には「している」を選択してください。例えば、今年度中に昨年度を対象とした評価又は情報公開を実施した場合は「している」を記入してください（なお、昨年度を対象とした評価又は情報公開を今年度の5月1日までに実施した場合、また、その結果を公表した場合を含みます）。"]
["３）","「自己評価」「学校関係者評価」「第三者評価」の欄には、以下に示す各評価について、実施及び結果公表をしているかどうか記入してください。\nなお、結果公表については、学校のホームページにおける公表に限らず、学校において閲覧に供する等でも構いません。例えば、学校便りに掲載する、PTA総会等の機会に保護者に対する説明を実施する、地域住民等が閲覧可能な場所に掲示する等も含みます。\nなお、自己評価の実施及び結果公表は法令上の義務であり、学校関係者評価の実施及び結果公表は法令上の努力義務です。"]
[null,"①","「自己評価」とは、学校教育法施行規則第66条（第189条及び第190条において、専修学校及び各種学校に準用。）の規定による、自己評価（教育活動その他の学校運営の状況について、自ら評価）を行うものであること。"]
[null,"②","「学校関係者評価」とは、学校教育法施行規則第67条（第189条及び第190条において、専修学校及び各種学校に準用。）の規定による、学校関係者評価（自己評価の結果を踏まえた当該校の生徒の保護者その他の当該校の関係者（当該校の職員を除く。）による評価）を行うものであること。"]
[null,"③","「第三者評価」とは、学校とその設置者が実施者となり、学校運営に関する外部の専門家を中心とした、当該学校から独立した第三者が、自己評価や学校関係者評価の実施状況も踏まえつつ、教育活動その他の学校運営の状況について、当該第三者が設定する評価基準に基づき、専門的・客観的視点から行う評価のこと。"]
["４）","「第三者評価」について「している」を選択した場合には、具体的な実施機関名を記載してください（自由記述）。"]
["５）","「情報公開」とは、学校教育法第43条（第133条及び第134条において、専修学校及び各種学校に準用。）に基づき教育活動その他の学校運営の状況に関する情報の提供を行うものであることをいいます。\nなお、学校のホームページにおける情報公開に限らず、学校において閲覧に供する等でも構いません。例えば、学校便りに掲載する、PTA総会等の機会に保護者に対する説明を実施する、地域住民等が閲覧可能な場所に掲示する等も含みます。"]
["６）","「情報公開」について「している」を選択した場合には、そのうち、財務情報等の公開に関する情報についても回答してください。"]
["７）","「財務情報等」とは一昨年度終了後2月以内に作成した財産目録、貸借対照表、収支計算書、事業報告書（それぞれの概要を含む）及び監査報告書をいいます。"]
["８）","「一般公開｣とは、「利害関係人への閲覧」以外で、広く一般（受験生等を含む。）に対し、学校法人等のホームページへの掲載、広報誌等の刊行物（パンフレット類を含む。）への掲載等の方法により、財務情報等を公開することをいう。"]
[]
[null,null,null,null,null,null,null,null,null,{"$f":"IF(COUNTIF(N:S,\"エラー\")=0,\"OK\",\"エラー\")","v":"エラー"}]
[]
[]
[]
[]
[null,null,null,null,null,null,null,null,null,{"$f":"IF(J36=\"エラー\",\"未記入の欄があります。確認してください。,\"\"\")","v":"未記入の欄があります。確認してください。,\""}]
[]
[]
[]
[]
[null,null,null,null,null,null,null,null,null,null,null,null,null,null,null,null,null,null,null,"都道府県名 1)",{"$f":"'様式３－２－１（学校基本情報）'!$C$4","v":"03岩   手"}]
[null,null,null,null,null,null,null,null,null,null,null,null,null,null,null,null,null,null,null,"設置者名",{"$f":"'様式３－２－１（学校基本情報）'!$C$5","v":0}]
[null,null,null,null,null,null,null,null,null,null,null,null,null,null,null,null,null,null,null,"設置者の種別 2)",{"$f":"'様式３－２－１（学校基本情報）'!$C$6","v":0}]
[null,null,null,null,null,null,null,null,null,null,null,null,null,null,null,null,null,null,null,null,{"$f":"'様式３－２－１（学校基本情報）'!$C$7","v":"（その他の法人の場合：　　　　　　　　　　　　　　　　　　　　）"}]
[null,null,null,null,null,null,null,null,null,null,null,null,null,null,null,null,null,null,null,"学校名",{"$f":"'様式３－２－１（学校基本情報）'!$C$8","v":0}]
[null,null,null,null,null,null,null,null,null,null,null,null,null,null,null,null,null,null,null,"学校コード 3)",{"$f":"'様式３－２－１（学校基本情報）'!$C$9","v":""}]
[null,null,null,null,null,null,null,null,null,null,null,null,null,null,null,null,null,null,null,"法人番号 4)",{"$f":"'様式３－２－１（学校基本情報）'!$C$10","v":0}]
[null,null,null,null,null,null,null,null,null,null,null,null,null,null,null,null,null,null,null,"担当者名 5)",{"$f":"'様式３－２－１（学校基本情報）'!$C$11","v":0}]
[null,null,null,null,null,null,null,null,null,null,null,null,null,null,null,null,null,null,null,"担当者の直通電話",{"$f":"'様式３－２－１（学校基本情報）'!$C$12","v":0}]
[null,null,null,null,null,null,null,null,null,null,null,null,null,null,null,null,null,null,null,"担当者のemail",{"$f":"'様式３－２－１（学校基本情報）'!$C$13","v":0}]

{"sheet":"（回答不要）学校コード","index":2,"n_rows":1048,"n_cols":3,"rows_kept":1048,"cut":false,"hidden":false,"merged":[]}
["文部科学省　学校コード（各種学校）"]
["学校名","学校コード","都道府県番号"]
["北海道文化高等編物学院","H201310100011","01(北海道)"]
["中央編物学校","H201310100020","01(北海道)"]
["中村編物技芸学園","H201310100039","01(北海道)"]
["北都編物服飾専門学院","H201310100048","01(北海道)"]
["北海道治療医学校","H201310100057","01(北海道)"]
["河合塾札幌校","H201310200010","01(北海道)"]
["北海道高等技能専修学校","H201310200029","01(北海道)"]
["札幌篠路自動車学校","H201310200038","01(北海道)"]
["幌北編物服装学院","H201310200047","01(北海道)"]
["創研学園看予備","H201310200056","01(北海道)"]
["駿台予備学校札幌校","H201310200065","01(北海道)"]
["大学受験予備校クラズユニック","H201310200074","01(北海道)"]
["札幌高等英語学院","H201310300019","01(北海道)"]
["北海道インターナショナルスクール","H201310500017","01(北海道)"]
["札幌井上速算学校","H201310500026","01(北海道)"]
["月寒洋裁女学院","H201310500035","01(北海道)"]
["札幌東自動車学校","H201310500044","01(北海道)"]
["北海道自動車学校","H201310500053","01(北海道)"]
["札幌高等実践学校","H201310500062","01(北海道)"]
["北海道朝鮮初中高級学校","H201311000010","01(北海道)"]
["五稜洋裁学院","H201320200019","01(北海道)"]
["函館ふじ文化服装学院","H201320200028","01(北海道)"]
["吉田服装女学校","H201320200037","01(北海道)"]
["道南編物服装学院","H201320200046","01(北海道)"]
["函館進学学院","H201320200055","01(北海道)"]
["鈴蘭文化洋裁学院","H201320200064","01(北海道)"]
["石田レディス洋裁学院","H201320200073","01(北海道)"]
["小樽ドレスメーカー女学院","H201320300018","01(北海道)"]
["北海道クミアイ自動車学校","H201320400017","01(北海道)"]
["道東自動車学校","H201320600015","01(北海道)"]
["帯広美術工芸学院","H201320700014","01(北海道)"]
["網走自動車学校","H201321100018","01(北海道)"]
["北海道農業協同組合学校","H201321700012","01(北海道)"]
["赤平ドレスメーカー女学院","H201321800011","01(北海道)"]
["千歳速算学校","H201322400013","01(北海道)"]
["深川医師会附属准看護学院","H201322800019","01(北海道)"]
["室蘭総合自動車学校","H201323000015","01(北海道)"]
["恵庭速算学校","H201323100014","01(北海道)"]
["北海道高等洋服女学院","H201323100023","01(北海道)"]
["八雲自動車学校","H201334600016","01(北海道)"]
["檜山服装学院","H201336100016","01(北海道)"]
["北海道インターナショナルスクール・ニセコ校","H201339500016","01(北海道)"]
["岩内ドレスメーカー女学院","H201340200017","01(北海道)"]
["昭和洋裁女学院角田分院","H201342900016","01(北海道)"]
["北海洋裁専門学校","H201343000013","01(北海道)"]
["沼田和裁学院","H201343800015","01(北海道)"]
["笹森服装学院","H201345900019","01(北海道)"]
["岩谷学園ひがし北海道日本語学校","H201389200014","01(北海道)"]
["青森市医師会立青森准看護学院","H202310000011","02(青森)"]
["青森タイピスト養成所","H202310000020","02(青森)"]
["木村簿記経理学校","H202310000039","02(青森)"]
["鷹揚ゼミナール","H202310000057","02(青森)"]
["Ｓ．Ｋ．Ｋ．弘前予備校","H202310000066","02(青森)"]
["八戸市医師会立八戸准看護学院","H202310000075","02(青森)"]
["五所川原予備校","H202310000084","02(青森)"]
["済誠会附属十和田准看護学院","H202310000093","02(青森)"]
["仁和会三沢中央病院附属准看護学院","H202310000100","02(青森)"]
["東北外語学院","H202310000119","02(青森)"]
["アシノ音楽学苑","H203320100018","03(岩手)"]
["関谷珠算学校","H203320100027","03(岩手)"]
["盛岡市医師会附属盛岡准看護学院","H203320100036","03(岩手)"]
["岩手第一珠算学校","H203320100045","03(岩手)"]
["盛岡市医師会附属盛岡高等看護学院","H203320100054","03(岩手)"]
["第一珠算学校","H203320600013","03(岩手)"]
["仙台ア－トスク－ルメロン","H204391010017","04(宮城)"]
["環球日本語学習院","H204391010026","04(宮城)"]
["東洋国際文化アカデミー","H204391010035","04(宮城)"]
["未来の杜学園","H204391010044","04(宮城)"]
["仙台国際日本語学校","H204391010053","04(宮城)"]
["理知の杜日本語学校仙台校","H204391010062","04(宮城)"]
["駿台予備学校仙台校","H204391020015","04(宮城)"]
["東北朝鮮初中高級学校","H204391040011","04(宮城)"]
["東北インターナショナルスクール","H204391050018","04(宮城)"]
["ホライゾンジャパンインターナショナルスクール仙台","H204391050027","04(宮城)"]
["石巻市医師会附属准看護学校","H204392020013","04(宮城)"]
["塩釜医師会附属准看護学院","H204392030011","04(宮城)"]
["気仙沼市医師会附属准看護学校","H204392050016","04(宮城)"]
["気仙沼市医師会附属高等看護学校","H204392050025","04(宮城)"]
["角田明和女学院","H204392080010","04(宮城)"]
["宮城高等技芸学院","H204392080029","04(宮城)"]
["医療法人社団スズキ病院附属助産学校","H204392110014","04(宮城)"]
["佐沼経理学校","H204392120012","04(宮城)"]
["大崎市医師会附属准看護学校","H204392150015","04(宮城)"]
["大崎市医師会附属高等看護学校","H204392150024","04(宮城)"]
["奥山編物学院","H204392150033","04(宮城)"]
["川崎和洋裁女学院","H204393240015","04(宮城)"]
["大郷女子技芸学校","H204394220017","04(宮城)"]
["秋田日本語学院","H205320100034","05(秋田)"]
["大場珠算簿記学校","H205320600020","05(秋田)"]
["アキタインターナショナルペットスクール","H205321000015","05(秋田)"]
["山形理容学校","H206320181017","06(山形)"]
["明徳予備校","H206320181035","06(山形)"]
["鶴岡准看護学院","H206320381015","06(山形)"]
["第一貨物流通技能専門校","H206321081016","06(山形)"]
["公立双葉准看護学院","H207254690011","07(福島)"]
["学校法人福島朝鮮学園福島朝鮮初中級学校","H207320391012","07(福島)"]
["学校法人尚志学園福島高等予備校","H207320391021","07(福島)"]
["駿優予備学校郡山校","H207320391030","07(福島)"]
["平成人学校","H207320491011","07(福島)"]
["いわき市医師会附属いわき准看護学校","H207320491020","07(福島)"]
["日本太平自動車学校","H207320491039","07(福島)"]
["常磐音楽舞踊学院","H207320491048","07(福島)"]
["いわき高等タイピスト学校","H207320491057","07(福島)"]
["修学館","H207321091013","07(福島)"]
["矢吹和裁学校","H207346691014","07(福島)"]
["茨城朝鮮初中高級学校","H208320100013","08(茨城)"]
["杉山編物技芸学院","H208320100022","08(茨城)"]
["水戸駿優予備学校","H208320100031","08(茨城)"]
["水戸筑波ゼミナール","H208320100040","08(茨城)"]
["土浦市医師会附属准看護学院","H208320300011","08(茨城)"]
["古河和装専門学院","H208320400010","08(茨城)"]
["サクラ服装学院","H208320500019","08(茨城)"]
["ＴＳＵＫＵＢＡＩＮＴＥＲＮＡＴＩＯＮＡＬＳＣＨＯＯＬ","H208322000010","08(茨城)"]
["日本つくば国際語学院","H208322000029","08(茨城)"]
["鹿島医師会附属准看護学院","H208322200018","08(茨城)"]
["真壁医師会准看護学院","H208322700013","08(茨城)"]
["下館文化服装学院","H208322700022","08(茨城)"]
["宇都宮服装文化学院","H209310000014","09(栃木)"]
["増美文化服装学院","H209310000023","09(栃木)"]
["こだま文化服装学院","H209310000032","09(栃木)"]
["日本簿記学校","H209310000041","09(栃木)"]
["小山珠算学院","H209310000050","09(栃木)"]
["真岡珠算簿記学校","H209310000069","09(栃木)"]
["見目計算実務学校","H209310000087","09(栃木)"]
["宇都宮病院附属准看護学校","H209310000096","09(栃木)"]
["足利市医師会付属准看護学校","H209310000103","09(栃木)"]
["佐野市医師会附属佐野准看護学校","H209310000112","09(栃木)"]
["上都賀郡市医師会附属准看護学校","H209310000121","09(栃木)"]
["昇玉学院","H209310000130","09(栃木)"]
["栃木県自動車学校","H209310000149","09(栃木)"]
["宇都宮タイピスト学院","H209310000158","09(栃木)"]
["栃木朝鮮初中級学校","H209310000167","09(栃木)"]
["好学院国際学校","H209310000176","09(栃木)"]
["セントメリー日本語学院","H209310000185","09(栃木)"]
["駒形珠算学校","H210310000011","10(群馬)"]
["前橋市医師会立前橋准看護学校","H210310000020","10(群馬)"]
["前橋ニュースタイル編物学院","H210310000039","10(群馬)"]
["ＮＩＰＰＯＮ文化学院","H210310000048","10(群馬)"]
["ＮＩＰＰＯＮ語学院","H210310000057","10(群馬)"]
["群馬朝鮮初中級学校","H210310000066","10(群馬)"]
["ＮＩＰＰＯＮ進学院","H210310000075","10(群馬)"]
["柘植珠算学校","H210310000084","10(群馬)"]
["小野池学院","H210310000093","10(群馬)"]
["桐生市医師会立桐生准看護学校","H210310000100","10(群馬)"]
["群馬和裁専門学院","H210310000119","10(群馬)"]
["あけぼの珠算学校","H210310000128","10(群馬)"]
["エスコーラパラレロ各種学校","H210310000137","10(群馬)"]
["伯人学校イーエーエス太田","H210310000146","10(群馬)"]
["沼田准看護学校","H210310000155","10(群馬)"]
["藤岡准看護学校","H210310000164","10(群馬)"]
["富岡市甘楽郡医師会立富岡准看護学校","H210310000173","10(群馬)"]
["安中市医師会立安中准看護学校","H210310000182","10(群馬)"]
["吾妻郡医師会立吾妻准看護学校","H210310000191","10(群馬)"]
["大宮医師会立大宮准看護学校","H211310200018","11(埼玉)"]
["埼玉県自動車学校","H211310200027","11(埼玉)"]
["大宮珠算学校","H211310300017","11(埼玉)"]
["埼玉朝鮮初中級学校","H211310300035","11(埼玉)"]
["埼玉日本語学校","H211310300053","11(埼玉)"]
["新藤花道学院","H211310700013","11(埼玉)"]
["武蔵浦和日本語学院","H211310800012","11(埼玉)"]
["山手日本語学校","H211320100018","11(埼玉)"]
["熊谷准看護学校","H211320200017","11(埼玉)"]
["鳩ケ谷珠算学校","H211320300016","11(埼玉)"]
["所沢市医師会立所沢准看護学院","H211320800011","11(埼玉)"]
["飯能研修学院","H211320900010","11(埼玉)"]
["本庄准看護学校","H211321100016","11(埼玉)"]
["東松山自動車学校","H211321200015","11(埼玉)"]
["比企准看護学校","H211321200024","11(埼玉)"]
["狭山市医師会立狭山准看護学校","H211321500012","11(埼玉)"]
["羽生高等簿記珠算学校","H211321600011","11(埼玉)"]
["北埼玉医師会准看護学校","H211321600020","11(埼玉)"]
["鴻巣准看護学校","H211321700010","11(埼玉)"]
["草加八潮医師会准看護学校","H211322100014","11(埼玉)"]
["入間准看護学校","H211322500010","11(埼玉)"]
["朝霞准看護学校","H211322700018","11(埼玉)"]
["桶川北本伊奈地区医師会立准看護学校","H211323300010","11(埼玉)"]
["各種学校インスチトゥトエドゥカシオナルティーエスレクレアソン","H211338500016","11(埼玉)"]
["千葉朝鮮初中級学校","H212310000019","12(千葉)"]
["若宮珠算学校","H212310000046","12(千葉)"]
["ふなばし美術学院","H212310000064","12(千葉)"]
["松戸第一珠算学校","H212310000073","12(千葉)"]
["馬橋珠算学校","H212310000082","12(千葉)"]
["藤工房和裁学院","H212310000091","12(千葉)"]
["石塚文化服装学院","H212310000117","12(千葉)"]
["一般社団法人香取郡市医師会附属佐原准看護学校","H212310000126","12(千葉)"]
["大塚ドレスメーカー女学院","H212310000135","12(千葉)"]
["全国漁業協同組合学校","H212310000144","12(千葉)"]
["日本語国際学院","H212310000153","12(千葉)"]
["市原女子服装学院","H212310000162","12(千葉)"]
["越川裁縫女學校","H212310000171","12(千葉)"]
["夷隅准看護師学校","H212310000180","12(千葉)"]
["御茶の水美術学院","H213310100017","13(東京)"]
["千代田予備校","H213310100026","13(東京)"]
["東京中華学校","H213310100035","13(東京)"]
["東京會舘クッキングスクール","H213310100053","13(東京)"]
["ドレスメーカーシック女学院","H213310100062","13(東京)"]
["神田静修学院","H213310100071","13(東京)"]
["アートマスターズスクール","H213310200016","13(東京)"]
{"$rows_left_out":849}
{"sheet":"Sheet2","index":3,"n_rows":49,"n_cols":5,"rows_kept":49,"cut":false,"hidden":true,"merged":[]}
[]
[null,"番号","都道府県名",null,"都道府県"]
[null,"01","北海道",null,"01北海道"]
[null,"02","青   森",null,"02青   森"]
[null,"03","岩   手",null,"03岩   手"]
[null,"04","宮   城",null,"04宮   城"]
[null,"05","秋   田",null,"05秋   田"]
[null,"06","山   形",null,"06山   形"]
[null,"07","福   島",null,"07福   島"]
[null,"08","茨   城",null,"08茨   城"]
[null,"09","栃   木",null,"09栃   木"]
[null,"10","群   馬",null,"10群   馬"]
[null,"11","埼   玉",null,"11埼   玉"]
[null,"12","千   葉",null,"12千   葉"]
[null,"13","東   京",null,"13東   京"]
[null,"14","神奈川",null,"14神奈川"]
[null,"15","新   潟",null,"15新   潟"]
[null,"16","富   山",null,"16富   山"]
[null,"17","石   川",null,"17石   川"]
[null,"18","福   井",null,"18福   井"]
[null,"19","山   梨",null,"19山   梨"]
[null,"20","長   野",null,"20長   野"]
[null,"21","岐   阜",null,"21岐   阜"]
[null,"22","静   岡",null,"22静   岡"]
[null,"23","愛   知",null,"23愛   知"]
[null,"24","三   重",null,"24三   重"]
[null,"25","滋   賀",null,"25滋   賀"]
[null,"26","京   都",null,"26京   都"]
[null,"27","大   阪",null,"27大   阪"]
[null,"28","兵   庫",null,"28兵   庫"]
[null,"29","奈   良",null,"29奈   良"]
[null,"30","和歌山",null,"30和歌山"]
[null,"31","鳥   取",null,"31鳥   取"]
[null,"32","島   根",null,"32島   根"]
[null,"33","岡   山",null,"33岡   山"]
[null,"34","広   島",null,"34広   島"]
[null,"35","山   口",null,"35山   口"]
[null,"36","徳   島",null,"36徳   島"]
[null,"37","香   川",null,"37香   川"]
[null,"38","愛   媛",null,"38愛   媛"]
[null,"39","高   知",null,"39高   知"]
[null,"40","福   岡",null,"40福   岡"]
[null,"41","佐   賀",null,"41佐   賀"]
[null,"42","長   崎",null,"42長   崎"]
[null,"43","熊   本",null,"43熊   本"]
[null,"44","大   分",null,"44大   分"]
[null,"45","宮   崎",null,"45宮   崎"]
[null,"46","鹿児島",null,"46鹿児島"]
[null,"47","沖   縄",null,"47沖   縄"]